program: Orca
programVersion: 5.0.2
elementType: Cl S F F F F O O O O O N N N N C C C C C C C C C C C C C C C C C H H H H H H H H H H H H H H H H
charge: -1
multiplicity: 1
keywords: wb97x-d3
keywords: def2-TZVPP
keywords: def2/J RIJCOSX
keywords: DEFGRID2
keywords: scfconv7
keywords: smallprint printgap noloewdin
keywords: NOSOSCF
formula: C17H16ClF4N4O5S
InChI: InChI=1/C17H16ClF4N4O5S/c1-8(2)25(4)32(30,31)23-15(28)9-5-12(11(19)6-10(9)18)26-14(27)7-13(17(20,21)22)24(3)16(26)29/h5-8H,1-4H3
48 atoms
Cl -3.107928 -3.267773 -1.310525
S  -3.066129 0.547596 0.703282
F  1.786676 -3.308272 -0.200858
F  6.17587 2.001844 -0.794656
F  5.407306 2.516167 1.135284
F  6.615026 0.745179 0.87871
O  -1.897067 1.376637 1.008927
O  -3.085084 -0.780627 1.317541
O  -2.941781 -0.340389 -2.913162
O  1.723324 -0.730677 1.774183
O  2.475976 -0.517017 -2.681557
N  -4.376082 1.358108 1.324368
N  -3.372594 0.50373 -0.87599
N  2.087899 -0.595973 -0.449592
N  3.665207 0.229468 1.088507
C  -4.4862 2.798898 1.030004
C  -4.916206 3.542035 2.28829
C  -5.402919 3.119631 -0.145651
C  -5.621439 0.608349 1.334597
C  0.831171 -1.224437 -0.669467
C  -1.511517 -1.090726 -1.231137
C  -2.684722 -0.268385 -1.713127
C  -0.283662 -0.481319 -1.014446
C  2.44643 -0.384436 0.869636
C  4.407545 0.692823 0.030785
C  2.846387 -0.244173 -1.56028
C  0.709464 -2.594316 -0.534033
C  4.056259 0.476281 -1.245694
C  -1.594445 -2.468554 -1.078888
C  -0.495355 -3.23519 -0.726426
C  4.040727 0.406703 2.493874
C  5.66227 1.493989 0.31853
H  -3.485781 3.149523 0.77667
H  -5.912672 3.244065 2.621678
H  -4.218111 3.366084 3.107244
H  -4.946553 4.616446 2.099522
H  -5.114884 2.566641 -1.038943
H  -5.340574 4.184067 -0.377444
H  -6.449177 2.899271 0.074048
H  -5.50414 -0.318789 1.890746
H  -6.00267 0.371212 0.336617
H  -6.378146 1.194649 1.853811
H  -0.187377 0.591259 -1.121047
H  4.645426 0.834175 -2.075093
H  -0.568655 -4.307275 -0.601889
H  3.669265 1.350858 2.8859
H  5.113712 0.347168 2.622435
H  3.61158 -0.401453 3.073675
elementType: Cl S F O N C H
totalener: -2510.75594157 hartree
nucrepener: 3911.25755803 hartree
electener: -6422.01349960 hartree
twoeener: 4847.25066175 hartree
cpcmener: -0.12242653 hartree
kineticenergy: 2502.90421084 hartree
xcener: -187.583956209452 hartree
chargesum: -1.0000000
charge: -0.069945 0.889079 -0.211005 -0.159192 -0.161591 -0.163414 -0.578586 -0.569541 -0.520849 -0.461371 -0.459820 -0.194351 -0.389893 -0.071575 -0.100900 0.079920 -0.265256 -0.287094 -0.217349 0.002061 -0.058282 0.213761 -0.111146 0.413184 0.009366 0.351001 0.233942 -0.162422 0.129010 -0.175926 -0.194547 0.537453 0.066318 0.081419 0.088196 0.088297 0.096906 0.096619 0.082237 0.115847 0.104963 0.108887 0.140895 0.138097 0.130331 0.139507 0.129945 0.116814
qa: -0.0699 0.8891 -0.2110 -0.1592 -0.1616 -0.1634 -0.5786 -0.5695 -0.5208 -0.4614 -0.4598 -0.1944 -0.3899 -0.0716 -0.1009 0.0799 -0.2653 -0.2871 -0.2173 0.0021 -0.0583 0.2138 -0.1111 0.4132 0.0094 0.3510 0.2339 -0.1624 0.1290 -0.1759 -0.1945 0.5375 0.0663 0.0814 0.0882 0.0883 0.0969 0.0966 0.0822 0.1158 0.1050 0.1089 0.1409 0.1381 0.1303 0.1395 0.1299 0.1168
va: 1.2479 6.0018 1.0843 1.1511 1.1484 1.1428 1.8723 1.8813 1.9528 2.0576 2.0528 2.9186 2.7009 3.1093 3.3619 3.9111 3.9137 3.8930 3.9380 3.5219 3.6274 4.4725 4.0797 4.2313 3.9708 4.2167 4.1350 3.8775 3.8593 4.0530 3.8602 4.4170 1.0329 1.0062 1.0160 1.0044 1.0308 1.0064 0.9979 1.0137 0.9975 0.9900 1.0299 1.0218 1.0175 0.9877 1.0064 1.0112
dispersion: -0.029217786 hartree
energy: -2510.785159354332 hartree
dipole: -49.54704 54.87891 5.33186 25.14563 -23.74738 1.39825 16.22356 -13.51149 2.71207
magnitude: 6.14322 au
magnitude: 15.61483 debye
