program: Orca
programVersion: 5.0.2
elementType: Cl S F F F F O O O O O N N N N C C C C C C C C C C C C C C C C C H H H H H H H H H H H H H H H H
charge: -1
multiplicity: 1
keywords: wb97x-d3
keywords: def2-TZVPP
keywords: def2/J RIJCOSX
keywords: DEFGRID2
keywords: scfconv7
keywords: smallprint printgap noloewdin
keywords: NOSOSCF
formula: C17H16ClF4N4O5S
InChI: InChI=1/C17H16ClF4N4O5S/c1-8(2)25(4)32(30,31)23-15(28)9-5-12(11(19)6-10(9)18)26-14(27)7-13(17(20,21)22)24(3)16(26)29/h5-8H,1-4H3
48 atoms
Cl -3.085934 -2.682725 -1.866407
S  -3.097156 0.644941 0.731826
F  1.758864 -3.100411 -0.615132
F  6.539234 1.721286 -0.355596
F  5.775239 2.042772 1.620281
F  6.769442 0.190636 1.123731
O  -1.888774 1.274287 1.268947
O  -3.284868 -0.766431 1.071221
O  -2.715258 0.483708 -2.969435
O  1.732742 -0.822145 1.725385
O  2.635479 -0.050921 -2.640676
N  -4.365703 1.472232 1.415227
N  -3.275432 0.932278 -0.840817
N  2.177965 -0.417707 -0.45073
N  3.780927 0.014733 1.216298
C  -5.718107 0.921413 1.21306
C  -6.468499 1.542666 0.040506
C  -6.511392 1.044309 2.507015
C  -4.252676 2.921256 1.369108
C  0.896604 -0.935161 -0.785261
C  -1.41879 -0.617796 -1.377307
C  -2.5433 0.315263 -1.763774
C  -0.176116 -0.100129 -1.037793
C  2.514185 -0.430616 0.890599
C  4.602502 0.533946 0.247361
C  2.998282 0.015382 -1.486157
C  0.717811 -2.303609 -0.864696
C  4.266962 0.547026 -1.051318
C  -1.557168 -1.997419 -1.448916
C  -0.501775 -2.856737 -1.187226
C  4.114244 -0.045727 2.642454
C  5.933581 1.125781 0.664931
H  -5.599101 -0.142625 1.008736
H  -7.407041 1.009265 -0.118163
H  -6.719586 2.58985 0.220426
H  -5.890995 1.480605 -0.880796
H  -6.679762 2.085945 2.788373
H  -5.998279 0.54909 3.331679
H  -7.491574 0.578524 2.39312
H  -3.332851 3.248089 1.847883
H  -5.075129 3.355444 1.935341
H  -4.283771 3.33375 0.356222
H  -0.034867 0.971094 -0.976404
H  4.918181 0.94972 -1.810622
H  -0.619195 -3.931094 -1.235299
H  3.647861 -0.924343 3.074027
H  3.752146 0.836572 3.16683
H  5.180066 -0.15349 2.79495
elementType: Cl S F O N C H
totalener: -2510.75591480 hartree
nucrepener: 3902.59373831 hartree
electener: -6413.34965311 hartree
twoeener: 4838.57647453 hartree
cpcmener: -0.12304566 hartree
kineticenergy: 2502.91587499 hartree
xcener: -187.585973208179 hartree
chargesum: -1.0000000
charge: -0.069932 0.885772 -0.211294 -0.158874 -0.161882 -0.163509 -0.579066 -0.566397 -0.524183 -0.461431 -0.460344 -0.192616 -0.395908 -0.071047 -0.103360 0.078914 -0.286963 -0.266591 -0.215870 0.004383 -0.042633 0.222264 -0.127002 0.415376 0.007226 0.349259 0.230841 -0.160724 0.126713 -0.170972 -0.185537 0.536868 0.065447 0.095775 0.082942 0.097674 0.081925 0.088419 0.088981 0.116979 0.108322 0.103078 0.140954 0.138106 0.130536 0.116187 0.139625 0.123566
qa: -0.0699 0.8858 -0.2113 -0.1589 -0.1619 -0.1635 -0.5791 -0.5664 -0.5242 -0.4614 -0.4603 -0.1926 -0.3959 -0.0710 -0.1034 0.0789 -0.2870 -0.2666 -0.2159 0.0044 -0.0426 0.2223 -0.1270 0.4154 0.0072 0.3493 0.2308 -0.1607 0.1267 -0.1710 -0.1855 0.5369 0.0654 0.0958 0.0829 0.0977 0.0819 0.0884 0.0890 0.1170 0.1083 0.1031 0.1410 0.1381 0.1305 0.1162 0.1396 0.1236
va: 1.2479 6.0120 1.0842 1.1520 1.1487 1.1428 1.8739 1.8875 1.9487 2.0571 2.0522 2.9143 2.6997 3.1112 3.3693 3.9139 3.8983 3.9138 3.9350 3.5091 3.6196 4.4603 4.1011 4.2284 3.9713 4.2199 4.1381 3.8760 3.8613 4.0543 3.8671 4.4201 1.0324 1.0069 0.9974 1.0273 1.0059 1.0158 1.0041 1.0142 0.9897 0.9990 1.0271 1.0218 1.0174 1.0079 0.9877 1.0104
dispersion: -0.029245532 hartree
energy: -2510.785160330457 hartree
dipole: -54.76573 60.02437 5.25864 17.98484 -17.62491 0.35993 17.89757 -14.96659 2.93098
magnitude: 6.03104 au
magnitude: 15.32969 debye
