program: Orca
programVersion: 5.0.2
elementType: Cl S F F F F O O O O O N N N N C C C C C C C C C C C C C C C C C H H H H H H H H H H H H H H H H
charge: -1
multiplicity: 1
keywords: wb97x-d3
keywords: def2-TZVPP
keywords: def2/J RIJCOSX
keywords: DEFGRID2
keywords: scfconv7
keywords: smallprint printgap noloewdin
keywords: NOSOSCF
formula: C17H16ClF4N4O5S
InChI: InChI=1/C17H16ClF4N4O5S/c1-8(2)25(4)32(30,31)23-15(28)9-5-12(11(19)6-10(9)18)26-14(27)7-13(17(20,21)22)24(3)16(26)29/h5-8H,1-4H3
48 atoms
Cl -3.066943 -2.656712 -1.980056
S  -3.089009 0.678086 0.695616
F  1.766903 -3.062664 -0.682212
F  6.53599 1.705897 -0.259012
F  5.760971 2.015484 1.714258
F  6.727079 0.155403 1.203938
O  -1.891051 1.339249 1.218932
O  -3.241425 -0.735646 1.046132
O  -2.735055 0.504385 -3.00794
O  1.718699 -0.935385 1.706125
O  2.603417 0.114238 -2.602412
N  -4.371745 1.479173 1.384661
N  -3.283361 0.954241 -0.876975
N  2.156125 -0.38144 -0.436062
N  3.751704 -0.017531 1.252873
C  -5.708093 0.8762 1.228283
C  -6.495496 1.417326 0.039889
C  -6.488835 1.031855 2.526272
C  -4.312992 2.929396 1.287268
C  0.885191 -0.902157 -0.802574
C  -1.423062 -0.588663 -1.422699
C  -2.551669 0.340317 -1.803551
C  -0.19041 -0.069675 -1.050511
C  2.493899 -0.471497 0.903035
C  4.574356 0.544189 0.307251
C  2.969377 0.116041 -1.447185
C  0.721519 -2.269413 -0.923281
C  4.238555 0.624574 -0.988272
C  -1.5476 -1.967459 -1.530237
C  -0.488782 -2.824383 -1.276697
C  4.129606 -0.160594 2.661496
C  5.910969 1.107849 0.748926
H  -5.555417 -0.191498 1.071814
H  -7.414956 0.842517 -0.081409
H  -6.783542 2.461452 0.177069
H  -5.92798 1.336323 -0.886315
H  -6.696578 2.078184 2.759289
H  -5.946285 0.597898 3.366537
H  -7.450543 0.522187 2.448647
H  -4.407457 3.304717 0.264367
H  -3.382795 3.302006 1.709263
H  -5.121624 3.354175 1.880205
H  -0.059141 1.000576 -0.960256
H  4.889468 1.063393 -1.727304
H  -0.596427 -3.898041 -1.354604
H  3.407905 -0.804856 3.147357
H  4.122713 0.798173 3.17348
H  5.100926 -0.635225 2.755366
elementType: Cl S F O N C H
totalener: -2510.75537400 hartree
nucrepener: 3903.33404706 hartree
electener: -6414.08942106 hartree
twoeener: 4839.32294405 hartree
cpcmener: -0.12231516 hartree
kineticenergy: 2502.92024185 hartree
xcener: -187.587244495992 hartree
chargesum: -1.0000000
charge: -0.070716 0.885523 -0.211138 -0.159848 -0.162632 -0.162263 -0.579267 -0.566957 -0.523100 -0.460115 -0.459214 -0.191309 -0.397370 -0.073347 -0.095085 0.076887 -0.288131 -0.267057 -0.216145 0.009630 -0.049842 0.224050 -0.120898 0.406291 0.010020 0.348345 0.230317 -0.156960 0.124038 -0.171637 -0.207530 0.538603 0.067062 0.095758 0.083446 0.097953 0.081945 0.088859 0.089230 0.102590 0.116880 0.108806 0.141287 0.137742 0.130857 0.117168 0.139036 0.138241
qa: -0.0707 0.8855 -0.2111 -0.1598 -0.1626 -0.1623 -0.5793 -0.5670 -0.5231 -0.4601 -0.4592 -0.1913 -0.3974 -0.0733 -0.0951 0.0769 -0.2881 -0.2671 -0.2161 0.0096 -0.0498 0.2240 -0.1209 0.4063 0.0100 0.3483 0.2303 -0.1570 0.1240 -0.1716 -0.2075 0.5386 0.0671 0.0958 0.0834 0.0980 0.0819 0.0889 0.0892 0.1026 0.1169 0.1088 0.1413 0.1377 0.1309 0.1172 0.1390 0.1382
va: 1.2471 6.0115 1.0850 1.1507 1.1453 1.1451 1.8725 1.8858 1.9500 2.0613 2.0532 2.9196 2.6960 3.1074 3.3465 3.9138 3.9012 3.9123 3.9350 3.5219 3.6207 4.4594 4.0885 4.2384 3.9795 4.2178 4.1351 3.8782 3.8622 4.0546 3.8413 4.4094 1.0321 1.0069 0.9971 1.0263 1.0058 1.0156 1.0039 0.9993 1.0147 0.9893 1.0289 1.0218 1.0171 1.0238 0.9908 0.9980
dispersion: -0.029222368 hartree
energy: -2510.784596365116 hartree
dipole: -54.84601 60.07577 5.22976 17.24140 -17.02091 0.22049 17.80967 -14.80929 3.00038
magnitude: 6.03335 au
magnitude: 15.33554 debye
