program: Orca
programVersion: 5.0.2
elementType: Cl S F F F F O O O O O N N N N C C C C C C C C C C C C C C C C C H H H H H H H H H H H H H H H H
charge: -1
multiplicity: 1
keywords: wb97x-d3
keywords: def2-TZVPP
keywords: def2/J RIJCOSX
keywords: DEFGRID2
keywords: scfconv7
keywords: smallprint printgap noloewdin
keywords: NOSOSCF
formula: C17H16ClF4N4O5S
InChI: InChI=1/C17H16ClF4N4O5S/c1-8(2)25(4)32(30,31)23-15(28)9-5-12(11(19)6-10(9)18)26-14(27)7-13(17(20,21)22)24(3)16(26)29/h5-8H,1-4H3
48 atoms
Cl -3.180175 -3.151187 -0.554897
S  -2.951903 1.223812 -0.044636
F  1.661835 -2.674257 -1.788721
F  6.088682 2.1350 -0.901705
F  5.76477 2.310949 1.207264
F  6.822897 0.608644 0.404437
O  -2.961392 0.547657 -1.343147
O  -1.783539 2.06614 0.223974
O  -2.833645 -1.629475 2.35475
O  2.5658 -1.689344 1.741496
O  1.703787 0.483744 -2.128816
N  -4.258577 2.251647 -0.042698
N  -3.255129 0.246707 1.195634
N  2.097509 -0.534015 -0.140992
N  4.094159 -0.157278 1.04524
C  -5.543944 1.701213 -0.512628
C  -6.268982 2.751918 -1.341968
C  -6.434027 1.161399 0.601832
C  -4.331534 3.154125 1.09485
C  0.827507 -1.170942 -0.205737
C  -1.479801 -1.325205 0.480772
C  -2.593462 -0.888508 1.403451
C  -0.233908 -0.718741 0.557455
C  2.903688 -0.853201 0.936365
C  4.483376 0.709916 0.054145
C  2.445322 0.316663 -1.18524
C  0.633632 -2.240226 -1.058895
C  3.727604 0.955829 -1.026057
C  -1.636514 -2.39133 -0.395937
C  -0.592468 -2.858725 -1.177424
C  4.9239 -0.497704 2.204543
C  5.803873 1.441955 0.19476
H  -5.306811 0.874067 -1.181388
H  -7.179246 2.32864 -1.76969
H  -6.56546 3.616809 -0.745103
H  -5.645078 3.103681 -2.164002
H  -5.91087 0.425175 1.210849
H  -7.308391 0.673659 0.167931
H  -6.799401 1.953742 1.258007
H  -3.420495 3.742756 1.172426
H  -4.500809 2.647313 2.049309
H  -5.148524 3.856074 0.935414
H  -0.079916 0.115737 1.228268
H  4.03397 1.639286 -1.801438
H  -0.723202 -3.684176 -1.864543
H  5.45252 0.37064 2.578633
H  5.629012 -1.290768 1.963067
H  4.279763 -0.839665 3.0058
elementType: Cl S F O N C H
totalener: -2510.75575754 hartree
nucrepener: 3904.69016181 hartree
electener: -6415.44591934 hartree
twoeener: 4840.69941040 hartree
cpcmener: -0.12237841 hartree
kineticenergy: 2502.90874272 hartree
xcener: -187.585048111750 hartree
chargesum: -1.0000000
charge: -0.070068 0.888446 -0.209624 -0.159477 -0.162240 -0.162084 -0.568014 -0.581488 -0.521933 -0.464059 -0.456628 -0.191158 -0.397947 -0.072687 -0.105616 0.073598 -0.266532 -0.288325 -0.214132 0.002861 -0.070846 0.225218 -0.093213 0.407938 0.010757 0.351011 0.230945 -0.153326 0.126824 -0.180350 -0.189631 0.534454 0.067865 0.089540 0.081974 0.089290 0.098617 0.095570 0.083832 0.115931 0.102025 0.107668 0.143831 0.137136 0.131381 0.126381 0.138956 0.117329
qa: -0.0701 0.8884 -0.2096 -0.1595 -0.1622 -0.1621 -0.5680 -0.5815 -0.5219 -0.4641 -0.4566 -0.1912 -0.3979 -0.0727 -0.1056 0.0736 -0.2665 -0.2883 -0.2141 0.0029 -0.0708 0.2252 -0.0932 0.4079 0.0108 0.3510 0.2309 -0.1533 0.1268 -0.1804 -0.1896 0.5345 0.0679 0.0895 0.0820 0.0893 0.0986 0.0956 0.0838 0.1159 0.1020 0.1077 0.1438 0.1371 0.1314 0.1264 0.1390 0.1173
va: 1.2485 6.0075 1.0862 1.1505 1.1439 1.1485 1.8799 1.8690 1.9513 2.0528 2.0592 2.9249 2.6962 3.1153 3.3632 3.9162 3.9125 3.9051 3.9368 3.5406 3.6294 4.4620 4.0633 4.2379 3.9697 4.2137 4.1423 3.8791 3.8503 4.0576 3.8605 4.4230 1.0319 1.0040 1.0058 1.0159 1.0232 1.0071 0.9974 1.0143 1.0006 0.9895 1.0321 1.0223 1.0168 1.0067 0.9874 1.0127
dispersion: -0.029224475 hartree
energy: -2510.784982013522 hartree
dipole: -51.87020 57.23525 5.36505 20.21694 -19.05312 1.16381 7.15081 -7.44962 -0.29881
magnitude: 5.49795 au
magnitude: 13.97469 debye
