program: Orca
programVersion: 5.0.2
elementType: Cl S F F F F O O O O O N N N N C C C C C C C C C C C C C C C C C H H H H H H H H H H H H H H H H
charge: -1
multiplicity: 1
keywords: wb97x-d3
keywords: def2-TZVPP
keywords: def2/J RIJCOSX
keywords: DEFGRID2
keywords: scfconv7
keywords: smallprint printgap noloewdin
keywords: NOSOSCF
formula: C17H16ClF4N4O5S
InChI: InChI=1/C17H16ClF4N4O5S/c1-8(2)25(4)32(30,31)23-15(28)9-5-12(11(19)6-10(9)18)26-14(27)7-13(17(20,21)22)24(3)16(26)29/h5-8H,1-4H3
48 atoms
Cl -3.691876 -2.31771 -1.890394
S  -3.298455 1.578279 0.436715
F  1.128509 -2.981856 -0.681756
F  6.234169 1.464777 -0.570632
F  5.368297 2.308591 1.195881
F  6.187273 0.31406 1.234693
O  -4.413366 2.326113 1.021855
O  -1.970448 2.163999 0.645504
O  -3.20303 0.650956 -3.170414
O  1.272796 -0.739724 1.573095
O  2.183304 -0.000921 -2.794537
N  -3.245607 0.048333 1.119444
N  -3.659003 1.393189 -1.107327
N  1.704047 -0.304251 -0.59984
N  3.276863 0.208824 1.074523
C  -2.344513 -0.134612 2.269759
C  -2.109603 -1.618665 2.512493
C  -2.812147 0.571584 3.539505
C  -4.552342 -0.585089 1.201986
C  0.401445 -0.771983 -0.929551
C  -1.895572 -0.330288 -1.523113
C  -2.977358 0.630395 -1.963276
C  -0.618271 0.11856 -1.218243
C  2.039609 -0.309348 0.741939
C  4.140613 0.62658 0.091501
C  2.541504 0.082341 -1.639753
C  0.141553 -2.12831 -0.958733
C  3.826641 0.578264 -1.211539
C  -2.115206 -1.702749 -1.540099
C  -1.114288 -2.614844 -1.24982
C  3.617879 0.176917 2.499877
C  5.49472 1.179727 0.49497
H  -1.384858 0.28934 1.976798
H  -1.301606 -1.743213 3.234104
H  -2.986857 -2.123229 2.920072
H  -1.815786 -2.12867 1.594054
H  -2.87608 1.651492 3.403364
H  -2.106472 0.388866 4.351586
H  -3.789415 0.215445 3.870842
H  -4.430704 -1.663842 1.277128
H  -5.118491 -0.397974 0.291431
H  -5.154585 -0.246128 2.049739
H  -0.403136 1.17786 -1.208043
H  4.506454 0.907029 -1.981006
H  -1.300781 -3.68051 -1.249884
H  4.196904 1.046256 2.787026
H  4.159529 -0.733302 2.751496
H  2.70211 0.206016 3.078278
elementType: Cl S F O N C H
totalener: -2510.75308053 hartree
nucrepener: 4049.46449180 hartree
electener: -6560.21757233 hartree
twoeener: 4983.50175724 hartree
cpcmener: -0.12078602 hartree
kineticenergy: 2502.89733061 hartree
xcener: -187.586381661218 hartree
chargesum: -1.0000000
charge: -0.075779 0.888615 -0.210666 -0.158965 -0.162289 -0.161373 -0.587984 -0.581126 -0.501835 -0.475276 -0.459126 -0.158253 -0.415388 -0.063922 -0.098556 0.089113 -0.311590 -0.293519 -0.236232 0.003913 -0.003295 0.222281 -0.123194 0.420265 0.010259 0.351924 0.247201 -0.157778 0.094093 -0.184295 -0.193458 0.535740 0.056884 0.101910 0.099714 0.101375 0.085831 0.091884 0.090162 0.105707 0.112085 0.113395 0.138180 0.137296 0.130438 0.128171 0.139080 0.118383
qa: -0.0758 0.8886 -0.2107 -0.1590 -0.1623 -0.1614 -0.5880 -0.5811 -0.5018 -0.4753 -0.4591 -0.1583 -0.4154 -0.0639 -0.0986 0.0891 -0.3116 -0.2935 -0.2362 0.0039 -0.0033 0.2223 -0.1232 0.4203 0.0103 0.3519 0.2472 -0.1578 0.0941 -0.1843 -0.1935 0.5357 0.0569 0.1019 0.0997 0.1014 0.0858 0.0919 0.0902 0.1057 0.1121 0.1134 0.1382 0.1373 0.1304 0.1282 0.1391 0.1184
va: 1.2381 5.9937 1.0846 1.1511 1.1450 1.1493 1.8755 1.8680 1.9702 2.0342 2.0539 2.8674 2.7293 3.1104 3.3700 3.8746 3.9089 3.9541 3.9587 3.5097 3.5959 4.4585 4.0496 4.2035 3.9678 4.2177 4.1191 3.8808 3.8541 4.0220 3.8578 4.4209 1.0369 1.0075 0.9992 1.0033 1.0254 1.0075 1.0008 0.9911 1.0144 1.0037 1.0370 1.0224 1.0191 1.0067 0.9873 1.0136
dispersion: -0.034414673 hartree
energy: -2510.787495199934 hartree
dipole: -28.63519 36.06783 7.43263 -4.23762 0.82309 -3.41454 29.23402 -25.19247 4.04155
magnitude: 9.12344 au
magnitude: 23.18995 debye
