program: Gaussian 09
title: 000070835
version: EM64L-G09RevD.01
frameworkgroup: C1[X(C11H16N4O2)]
method: RPBEPBE
basis: SDD
operation: Freq
keyword: #p
keyword: freq=noraman
keyword: PBEPBE/SDD
title: #p freq=noraman PBEPBE/SDD
converged: YES YES NO NO
title: Mulliken charges:
elementType: O O N N N N C C C C C C C C C C C H H H H H H H H H H H H H H H H
charge: -0.269344 -0.269401 -0.229111 -0.154334 -0.139597 -0.091276 -0.339789 0.125318 -0.350865 0.073352 0.179385 0.208189 -0.345819 -0.227399 -0.612229 -0.597573 -0.700524 0.239886 0.240214 0.222371 0.213787 0.199136 0.200981 0.268659 0.270671 0.247225 0.247190 0.221535 0.263308 0.262453 0.214390 0.216428 0.212785
chargesum: 0.00000
title: Mulliken charges with hydrogens summed into heavy atoms:
elementType: O O N N N N C C C C C C C C C C C
charge: -0.269344 -0.269401 -0.229111 -0.154334 -0.139597 -0.091276 0.140311 0.125318 0.085293 0.073352 0.179385 0.208189 0.054298 0.041259 0.152857 0.149723 -0.056921
polarizability: 1.97454057e+02 -4.16987302e+00 1.68048814e+02 1.38930647e+01 3.75540534e+00 9.48755019e+01
1716.lowfreq: -22.9556 -14.0969 -4.2827 -0.0006 0.0005 0.0007 0.7156 28.3768 42.9552
frequency: -22.8010 28.1856 42.7741 66.9769 85.0322 93.1402 104.6419 110.6443 138.8834 166.5068 196.8093 227.1776 234.1957 236.7623 293.5143 308.0604 352.9012 369.2742 380.2116 410.2510 428.5397 444.0552 494.8457 567.9018 603.9617 630.5586 671.6154 705.3823 718.9961 735.4106 746.2797 759.2885 801.8083 805.4999 898.7810 905.2319 931.8641 963.5191 1016.1929 1034.8584 1056.6218 1067.1304 1074.0660 1114.9214 1124.7603 1131.5119 1166.3343 1186.8119 1195.2892 1219.4668 1246.7955 1263.2631 1269.8147 1290.0059 1294.2551 1324.8150 1336.4377 1346.0844 1362.4366 1370.3026 1392.3839 1406.9605 1421.3890 1440.7544 1455.7202 1456.5969 1467.3977 1475.7476 1478.1120 1478.5700 1480.4850 1485.9318 1487.2892 1508.5526 1570.5786 1610.3874 1645.7058 2967.9783 2974.5587 2988.2037 3008.0399 3012.0999 3013.0636 3034.0888 3048.7509 3071.9129 3073.0930 3097.3239 3102.9715 3111.9198 3122.6633 3140.2948 3239.2871
redmass: 1.0954 3.7928 5.2172 1.5692 1.6150 1.7637 2.8537 3.0126 4.0345 5.6366 3.2484 4.0825 1.2207 3.4148 2.7899 5.0591 2.7722 6.9373 6.2699 7.3820 3.9209 5.8500 5.7349 6.9013 3.8410 6.1192 9.1805 8.7840 3.3151 1.3529 9.3870 1.9571 1.4758 1.8150 2.1302 2.0690 1.8200 4.5099 3.5035 2.7597 2.2633 2.1153 2.5026 2.4096 1.3223 1.2953 2.0986 2.4812 4.0594 2.2650 1.4709 5.1140 1.3075 1.1038 5.3023 3.1513 1.3451 1.4794 4.1428 1.4890 1.2164 1.9730 1.2905 1.1606 1.4377 1.1544 1.0716 1.0655 1.0425 1.0466 1.2354 1.2200 1.0792 2.5063 8.1822 11.0392 10.2110 1.0578 1.0371 1.0588 1.0336 1.1001 1.0329 1.0581 1.1033 1.1009 1.0995 1.1025 1.1063 1.1024 1.1031 1.1012 1.0989
irintensity: 0.3517 0.4166 1.9127 0.1031 0.2104 0.0432 0.1489 1.3940 13.8964 0.2568 7.9613 2.8995 0.1327 2.6373 1.2693 9.2316 5.9486 0.0474 4.2291 10.1012 5.1325 15.3546 15.1898 5.2780 14.1452 4.4285 0.0061 8.6546 3.3183 16.4764 8.9074 0.4474 26.8339 1.1911 5.1736 1.1470 25.1396 1.5433 3.7692 22.2874 12.2340 18.0332 0.3401 18.7253 0.9897 0.2780 68.8998 2.0890 14.9680 75.0602 0.8650 31.9356 1.0723 5.5343 71.1209 25.2224 10.4727 3.4022 1.4423 0.4321 10.4224 36.5817 29.6204 28.1342 130.7153 55.6292 0.6605 5.1536 12.2645 17.4977 50.9637 23.4232 18.5671 65.9385 7.5889 566.0623 369.7786 31.2269 33.1021 28.9937 37.9471 5.4541 29.3776 24.9393 9.6995 67.5472 56.1495 17.8938 6.6796 9.9174 11.0279 0.4315 1.3863
temp: 298.150 k
press: 1.00000 atm
elementType: 8 8 7 7 7 7 6 6 6 6 6 6 6 6 6 6 6 1 1 1 1 1 1 1 1 1 1 1 1 1 1 1 1
symmnumber: 1
zpe: 702330.4 jmol-1
zpe.correction: 0.267504 hartree
zpe.thermalcorrener: 0.284090 hartree
zpe.thermalcorrenthalpy: 0.285034 hartree
zpe.thermalcorrgfe: 0.222179 hartree
zpe.sumelectzpe: -796.985063 hartree
zpe.sumelectthermal: -796.968477 hartree
zpe.sumelectthermalent: -796.967532 hartree
zpe.sumelectthermalfe: -797.030388 hartree
dipole: 2.9666 -2.1264 0.7183
dipole: 3.7200
quadrupole: -90.9499 -101.7883 -101.2442
quadrupole: -7.8741 0.2619 -1.1766
quadrupole: 7.0443 -3.7942 -3.2501 -7.8741 0.2619 -1.1766
hfenergy: -797.252567 hartree
pointgroup: C01 [X(C11H16N4O2)]
dipole: -1.1552054 0.8648635 0.2439283 debye
polarizability: 197.6359134|-5.0055879|167.9590102|-12.4957165|-5.5857997|94.7834489 unknown
InChI: InChI=1S/C11H16N4O2/c1-4-5-6-15-10(16)8-9(12-7-13(8)2)14(3)11(15)17/h7H,4-6H2,1-3H3
charge 0 multiplicity 1
33 atoms
O  0.338257 2.205676 -0.644154
O  1.192256 -2.428544 -0.365551
N  0.734781 -0.127303 -0.514352
N  -0.996845 -1.711203 0.07025
N  -2.603494 1.468166 0.121614
N  -3.220971 -0.705643 0.495746
C  2.164125 0.101185 -0.868901
C  -1.457568 0.679787 -0.071725
C  3.064681 0.25688 0.374846
C  -1.873514 -0.641618 0.165843
C  -0.106632 1.035252 -0.424747
C  0.358462 -1.482633 -0.2729
C  4.540483 0.486657 -0.021747
C  -3.623337 0.593161 0.456507
C  -1.465254 -3.08656 0.329742
C  -2.688675 2.931034 -0.014569
C  5.465646 0.639649 1.204079
H  2.495596 -0.760904 -1.471486
H  2.195259 1.019711 -1.478956
H  2.986296 -0.655208 0.997035
H  2.705769 1.11084 0.981614
H  4.613839 1.393237 -0.656333
H  4.888292 -0.363255 -0.643421
H  -4.637129 0.928377 0.662691
H  -0.605184 -3.75971 0.203759
H  -2.265936 -3.352934 -0.380263
H  -1.86412 -3.162891 1.35501
H  -3.720262 3.248162 0.207686
H  -1.991235 3.421386 0.682914
H  -2.41969 3.236756 -1.038199
H  5.4369 -0.266403 1.838021
H  6.515145 0.805249 0.898785
H  5.156459 1.49764 1.830262
