program: Orca
programVersion: 5.0.2
elementType: Cl S F F F F O O O O O N N N N C C C C C C C C C C C C C C C C C H H H H H H H H H H H H H H H H
charge: -1
multiplicity: 1
keywords: wb97x-d3
keywords: def2-TZVPP
keywords: def2/J RIJCOSX
keywords: DEFGRID2
keywords: scfconv7
keywords: smallprint printgap noloewdin
keywords: NOSOSCF
formula: C17H16ClF4N4O5S
InChI: InChI=1/C17H16ClF4N4O5S/c1-8(2)25(4)32(30,31)23-15(28)9-5-12(11(19)6-10(9)18)26-14(27)7-13(17(20,21)22)24(3)16(26)29/h5-8H,1-4H3
48 atoms
Cl -3.701265 -2.258145 -1.690625
S  -3.223039 1.567182 0.432382
F  1.084489 -2.969143 -0.388612
F  6.209415 1.63304 -0.641514
F  5.334924 2.414299 1.151651
F  6.276481 0.474185 1.155918
O  -4.282248 2.408545 0.997691
O  -1.855046 2.031606 0.691546
O  -3.138225 0.648302 -3.17861
O  1.323728 -0.640877 1.617043
O  2.205133 -0.065348 -2.78145
N  -3.334574 0.029658 1.075899
N  -3.558523 1.450274 -1.130341
N  1.755069 -0.305163 -0.572093
N  3.348608 0.245365 1.067336
C  -2.415415 -0.307958 2.176244
C  -2.405441 -1.812512 2.40742
C  -2.712117 0.43373 3.475184
C  -4.703818 -0.45068 1.189672
C  0.443424 -0.768711 -0.870008
C  -1.839171 -0.313859 -1.502304
C  -2.900978 0.649444 -1.969225
C  -0.547466 0.121679 -1.247605
C  2.099588 -0.258238 0.767507
C  4.182225 0.67756 0.063357
C  2.575983 0.06134 -1.63133
C  0.136208 -2.112444 -0.766088
C  3.85103 0.600314 -1.234013
C  -2.103742 -1.673191 -1.398381
C  -1.132065 -2.584955 -1.025362
C  3.745337 0.233003 2.480663
C  5.51466 1.300264 0.440126
H  -1.41659 -0.037866 1.835102
H  -1.54645 -2.0689 3.027539
H  -3.298648 -2.159897 2.928107
H  -2.315494 -2.364968 1.47279
H  -2.619421 1.513728 3.363374
H  -2.00773 0.125429 4.24916
H  -3.716282 0.213505 3.841513
H  -4.701106 -1.535739 1.261278
H  -5.26841 -0.201428 0.293284
H  -5.239302 -0.04964 2.054495
H  -0.302821 1.171375 -1.334606
H  4.506811 0.943289 -2.01796
H  -1.351416 -3.63942 -0.92631
H  4.079545 1.213655 2.802156
H  4.516411 -0.510889 2.660125
H  2.882836 -0.025534 3.079959
elementType: Cl S F O N C H
totalener: -2510.75681860 hartree
nucrepener: 4060.85225006 hartree
electener: -6571.60906866 hartree
twoeener: 4995.13071506 hartree
cpcmener: -0.14458748 hartree
kineticenergy: 2502.90625612 hartree
xcener: -187.594359044154 hartree
chargesum: -1.0000000
charge: -0.071033 0.905700 -0.208089 -0.159207 -0.161247 -0.161044 -0.604033 -0.591865 -0.543657 -0.500065 -0.492613 -0.160602 -0.422542 -0.056616 -0.085496 0.099577 -0.316485 -0.296895 -0.231847 -0.002640 -0.014496 0.243256 -0.136509 0.426407 0.016534 0.375626 0.263985 -0.156951 0.098102 -0.192255 -0.199307 0.538352 0.046064 0.108096 0.102491 0.107625 0.084162 0.096847 0.096018 0.108339 0.116059 0.114898 0.142437 0.140282 0.138862 0.138632 0.140855 0.116285
qa: -0.0710 0.9057 -0.2081 -0.1592 -0.1612 -0.1610 -0.6040 -0.5919 -0.5437 -0.5001 -0.4926 -0.1606 -0.4225 -0.0566 -0.0855 0.0996 -0.3165 -0.2969 -0.2318 -0.0026 -0.0145 0.2433 -0.1365 0.4264 0.0165 0.3756 0.2640 -0.1570 0.0981 -0.1923 -0.1993 0.5384 0.0461 0.1081 0.1025 0.1076 0.0842 0.0968 0.0960 0.1083 0.1161 0.1149 0.1424 0.1403 0.1389 0.1386 0.1409 0.1163
va: 1.2464 5.9529 1.0899 1.1515 1.1471 1.1491 1.8541 1.8516 1.9143 2.0060 2.0133 2.8781 2.7337 3.1163 3.3687 3.8697 3.9127 3.9555 3.9481 3.5310 3.5718 4.4425 4.0453 4.1925 3.9772 4.1812 4.0959 3.8973 3.8503 3.9963 3.8367 4.4138 1.0346 1.0058 0.9967 0.9989 1.0249 1.0066 1.0003 0.9927 1.0093 1.0033 1.0330 1.0210 1.0158 0.9988 0.9900 1.0240
dispersion: -0.034738359 hartree
energy: -2510.791556959393 hartree
dipole: -29.47142 36.93643 7.46501 -5.48921 1.84711 -3.64210 28.11928 -23.79379 4.32549
magnitude: 9.36488 au
magnitude: 23.80365 debye
