program: Orca
programVersion: 5.0.2
elementType: Cl S F F F F O O O O O N N N N C C C C C C C C C C C C C C C C C H H H H H H H H H H H H H H H H
charge: -1
multiplicity: 1
keywords: wb97x-d3
keywords: def2-TZVPP
keywords: def2/J RIJCOSX
keywords: DEFGRID2
keywords: scfconv7
keywords: smallprint printgap noloewdin
keywords: NOSOSCF
formula: C17H16ClF4N4O5S
InChI: InChI=1/C17H16ClF4N4O5S/c1-8(2)25(4)32(30,31)23-15(28)9-5-12(11(19)6-10(9)18)26-14(27)7-13(17(20,21)22)24(3)16(26)29/h5-8H,1-4H3
48 atoms
Cl -3.021374 -1.840353 -1.693993
S  -4.309458 0.709715 1.796072
F  1.965972 -2.328319 -1.825796
F  7.133608 1.166352 -0.67079
F  6.694739 1.583933 1.382533
F  7.129489 -0.435452 0.749563
O  -4.079017 2.125116 2.094456
O  -4.577239 -0.146962 2.950842
O  -2.544326 1.769498 -0.384826
O  2.344199 -1.220704 1.591808
O  2.60164 0.891105 -2.397047
N  -5.694175 0.644167 0.872706
N  -3.077578 -0.005409 1.024897
N  2.460303 -0.102684 -0.366149
N  4.29839 -0.177101 1.092436
C  -5.923028 1.674704 -0.15799
C  -7.333084 2.229475 -0.013259
C  -5.679998 1.184749 -1.580584
C  -6.172286 -0.692797 0.55603
C  1.124561 -0.500072 -0.644446
C  -1.260391 -0.194601 -0.456471
C  -2.403717 0.632239 0.076456
C  0.038698 0.218982 -0.184817
C  2.998278 -0.548763 0.825143
C  5.04606 0.453637 0.130494
C  3.152711 0.577067 -1.36059
C  0.908342 -1.635554 -1.403721
C  4.532513 0.840349 -1.046806
C  -1.43495 -1.323897 -1.246426
C  -0.360538 -2.055192 -1.731834
C  4.814528 -0.611305 2.394496
C  6.515499 0.695673 0.403688
H  -5.22863 2.488998 0.03862
H  -8.089685 1.460043 -0.178845
H  -7.491064 2.655682 0.977216
H  -7.503229 3.018189 -0.747143
H  -4.70804 0.709222 -1.700577
H  -5.716669 2.033757 -2.263755
H  -6.443137 0.475518 -1.904472
H  -6.213552 -1.307394 1.451488
H  -5.56569 -1.209872 -0.190773
H  -7.189849 -0.620987 0.175549
H  0.207445 1.107698 0.410142
H  5.12624 1.334768 -1.798589
H  -0.503412 -2.931396 -2.349827
H  5.163318 -1.639482 2.354172
H  4.020267 -0.536408 3.127566
H  5.610689 0.034009 2.735946
elementType: Cl S F O N C H
totalener: -2510.76256149 hartree
nucrepener: 3812.51149004 hartree
electener: -6323.27405154 hartree
twoeener: 4747.05613380 hartree
cpcmener: -0.14681628 hartree
kineticenergy: 2502.92818615 hartree
xcener: -187.591634297095 hartree
chargesum: -1.0000000
charge: -0.072032 0.892280 -0.207910 -0.158071 -0.162004 -0.161210 -0.587687 -0.603476 -0.574966 -0.493784 -0.494055 -0.180220 -0.457504 -0.063228 -0.100404 0.071930 -0.272448 -0.285248 -0.218232 -0.053953 0.119769 0.233017 -0.114272 0.434246 0.013184 0.374931 0.243925 -0.155908 0.103669 -0.177057 -0.185416 0.538158 0.065477 0.085114 0.087478 0.091783 0.077932 0.106288 0.093471 0.118555 0.102911 0.115589 0.147291 0.139483 0.137644 0.141212 0.115841 0.127906
qa: -0.0720 0.8923 -0.2079 -0.1581 -0.1620 -0.1612 -0.5877 -0.6035 -0.5750 -0.4938 -0.4941 -0.1802 -0.4575 -0.0632 -0.1004 0.0719 -0.2724 -0.2852 -0.2182 -0.0540 0.1198 0.2330 -0.1143 0.4342 0.0132 0.3749 0.2439 -0.1559 0.1037 -0.1771 -0.1854 0.5382 0.0655 0.0851 0.0875 0.0918 0.0779 0.1063 0.0935 0.1186 0.1029 0.1156 0.1473 0.1395 0.1376 0.1412 0.1158 0.1279
va: 1.2478 6.0155 1.0894 1.1536 1.1461 1.1501 1.8655 1.8747 1.8928 2.0168 2.0121 2.9049 2.6923 3.1190 3.3821 3.8712 3.9367 3.8964 3.9363 3.5543 3.5931 4.3066 4.0820 4.2104 3.9756 4.1836 4.1214 3.8857 3.8603 4.0598 3.8651 4.4194 1.0436 1.0056 1.0149 1.0031 1.0260 1.0066 0.9978 1.0174 0.9903 0.9907 1.0173 1.0210 1.0148 0.9881 1.0055 1.0105
dispersion: -0.029105337 hartree
energy: -2510.791666828728 hartree
dipole: -58.93196 65.90897 6.97701 8.43860 -10.32143 -1.88283 2.28112 -4.43953 -2.15841
magnitude: 7.54204 au
magnitude: 19.17035 debye
