program: Orca
programVersion: 5.0.2
elementType: S S O O O O N N N N C C C C C C C C C C C C H H H H H H H H H H H H H
charge: -1
multiplicity: 1
keywords: wb97x-d3
keywords: def2-TZVPP
keywords: def2/J RIJCOSX
keywords: DEFGRID2
keywords: scfconv7
keywords: smallprint printgap noloewdin
keywords: NOSOSCF
formula: C12H13N4O4S2
InChI: InChI=1/C12H13N4O4S2/c1-19-11(17)15-9(21)13-7-5-3-4-6-8(7)14-10(22)16-12(18)20-2/h3-6,13-15H,1-2H3
35 atoms
S  -0.124366 1.961881 -1.209976
S  -1.157459 -2.40149 1.401691
O  2.863539 2.228036 1.840067
O  2.96335 -1.978924 -0.926732
O  2.706559 0.876887 0.067055
O  1.325187 -1.24683 -2.279432
N  -1.326819 1.088299 0.987747
N  -1.064465 -1.026254 -0.8755
N  0.846184 1.503697 1.293448
N  0.902826 -2.010602 -0.153379
C  -2.437219 0.613935 0.278868
C  -2.334983 -0.463825 -0.610005
C  -3.694062 1.148422 0.526392
C  -3.455708 -0.955113 -1.252041
C  -4.822815 0.640487 -0.100858
C  -4.705459 -0.40613 -0.999747
C  -0.12744 1.481744 0.416625
C  -0.437687 -1.76293 0.043255
C  2.138095 1.493761 0.948005
C  1.701394 -1.674445 -1.222964
C  4.254867 2.202026 1.665827
C  3.938765 -1.4606 -1.815353
H  -3.77159 1.983335 1.210337
H  -3.341928 -1.784664 -1.937234
H  -1.226714 0.734758 1.929583
H  -0.494993 -0.483782 -1.530362
H  -5.793224 1.074958 0.104036
H  -5.580967 -0.800679 -1.49904
H  1.354052 -2.403674 0.656811
H  4.673557 1.195008 1.750779
H  4.569082 2.610613 0.701688
H  4.673919 2.82065 2.460409
H  3.867089 -0.376243 -1.875882
H  4.901193 -1.738083 -1.391212
H  3.847234 -1.890497 -2.814099
totalener: -1781.63301607 hartree
nucrepener: 2211.73303339 hartree
electener: -3993.36604946 hartree
oneelecener: -6868.35766473 hartree
twoeener: 2874.99161526 hartree
kineticenergy: 1776.49287392 hartree
xcener: -129.963335610787 hartree
chargesum: -1.0000000
charge: -0.514631 -0.422575 -0.290691 -0.302948 -0.476136 -0.386558 -0.179948 -0.162349 -0.426906 -0.139884 0.115003 0.140228 -0.164028 -0.174489 -0.112238 -0.096354 0.220869 0.190002 0.456547 0.476716 -0.126980 -0.122685 0.109967 0.104231 0.140859 0.207006 0.101099 0.100476 0.149775 0.079096 0.089197 0.089933 0.134544 0.095774 0.098077
qa: -0.5146 -0.4226 -0.2907 -0.3029 -0.4761 -0.3866 -0.1799 -0.1623 -0.4269 -0.1399 0.1150 0.1402 -0.1640 -0.1745 -0.1122 -0.0964 0.2209 0.1900 0.4565 0.4767 -0.1270 -0.1227 0.1100 0.1042 0.1409 0.2070 0.1011 0.1005 0.1498 0.0791 0.0892 0.0899 0.1345 0.0958 0.0981
va: 1.8911 1.9927 2.0506 2.0825 2.0058 2.1123 3.0368 3.2056 2.9118 3.2068 3.9945 3.8722 4.0785 4.1269 3.9651 3.9463 4.3521 4.3594 4.4047 4.3231 3.9681 3.8914 1.0231 1.0222 1.0556 1.0573 1.0028 1.0039 1.0627 0.9980 0.9956 0.9963 1.0047 0.9937 0.9967
dispersion: -0.020686832 hartree
energy: -1781.653702900252 hartree
dipole: 7.54335 -7.44066 0.10269 1.28613 -2.67426 -1.38814 -1.22496 1.08137 -0.14359
magnitude: 1.39932 au
magnitude: 3.55678 debye
