program: Orca
programVersion: 5.0.2
elementType: S S O O O O N N N N C C C C C C C C C C C C C C H H H H H H H H H H H H H H H H H
charge: -1
multiplicity: 1
keywords: wb97x-d3
keywords: def2-TZVPP
keywords: def2/J RIJCOSX
keywords: DEFGRID2
keywords: scfconv7
keywords: smallprint printgap noloewdin
keywords: NOSOSCF
formula: C14H17N4O4S2
InChI: InChI=1/C14H17N4O4S2/c1-3-21-13(19)17-11(23)15-9-7-5-6-8-10(9)16-12(24)18-14(20)22-4-2/h5-8,15-17H,3-4H2,1-2H3
41 atoms
S  0.836763 3.024285 -0.423947
S  -1.053319 -2.973389 -0.422013
O  1.712186 -0.032379 -1.246582
O  2.726373 -1.271496 1.889351
O  0.708278 0.084032 -3.246636
O  0.976139 0.074289 2.292864
N  -1.452279 1.925479 0.257454
N  -1.237609 -0.722996 1.02167
N  -0.37693 0.794203 -1.386238
N  0.748608 -1.879261 1.118875
C  -2.573818 1.085351 0.193297
C  -2.472844 -0.271317 0.533999
C  -3.816851 1.602199 -0.156812
C  -3.595997 -1.086227 0.478936
C  -4.937828 0.788447 -0.200465
C  -4.82292 -0.560565 0.103026
C  -0.3445 1.802612 -0.561999
C  -0.537671 -1.781115 0.616283
C  0.686882 0.31301 -2.048835
C  1.456429 -0.927042 1.806911
C  2.869802 -0.614713 -1.838763
C  3.635671 -0.336403 2.503578
C  3.797536 0.417147 -2.442136
C  4.05018 0.759554 1.550353
H  -3.894524 2.65189 -0.412944
H  -3.514805 -2.127882 0.752969
H  -1.59512 2.846166 0.642737
H  -0.723601 -0.0409 1.57778
H  -5.895548 1.206877 -0.481701
H  -5.691509 -1.205069 0.068505
H  1.266781 -2.671722 0.763466
H  2.59016 -1.367657 -2.57852
H  3.369646 -1.136131 -1.021861
H  4.491911 -0.945451 2.787966
H  3.195931 0.068373 3.415541
H  4.714139 -0.071648 -2.775661
H  3.353996 0.914454 -3.304314
H  4.073003 1.179858 -1.712702
H  4.764867 1.409826 2.057189
H  4.545069 0.353423 0.667627
H  3.211553 1.378069 1.229694
elementType: S O N C H
totalener: -1860.37336170 hartree
nucrepener: 2565.43018264 hartree
electener: -4425.80354434 hartree
oneelecener: -7682.27340690 hartree
twoeener: 3256.46986256 hartree
cpcmener: -0.11115664 hartree
kineticenergy: 1854.65482321 hartree
xcener: -138.322773361562 hartree
chargesum: -1.0000000
charge: -0.603347 -0.441078 -0.279923 -0.304287 -0.519362 -0.467411 -0.187641 -0.140742 -0.387081 -0.140251 0.110960 0.169715 -0.202640 -0.180128 -0.140293 -0.152125 0.185461 0.201945 0.378043 0.510042 0.025003 0.048293 -0.259598 -0.248241 0.143492 0.133767 0.146744 0.194730 0.154985 0.154045 0.178726 0.095079 0.090129 0.110334 0.098221 0.095615 0.092774 0.076598 0.105847 0.082491 0.071109
qa: -0.6033 -0.4411 -0.2799 -0.3043 -0.5194 -0.4674 -0.1876 -0.1407 -0.3871 -0.1403 0.1110 0.1697 -0.2026 -0.1801 -0.1403 -0.1521 0.1855 0.2019 0.3780 0.5100 0.0250 0.0483 -0.2596 -0.2482 0.1435 0.1338 0.1467 0.1947 0.1550 0.1540 0.1787 0.0951 0.0901 0.1103 0.0982 0.0956 0.0928 0.0766 0.1058 0.0825 0.0711
va: 1.7888 1.9535 2.0186 2.1201 1.9690 2.0336 3.0704 3.2711 2.8528 3.2276 3.8568 3.7191 4.0012 4.0089 3.9056 3.9347 4.3394 4.3185 4.5395 4.2798 3.8207 3.8370 3.9144 3.9061 1.0067 1.0385 1.0509 1.0525 0.9904 0.9923 1.0364 1.0219 1.0013 0.9952 1.0105 1.0096 1.0175 1.0082 1.0127 1.0017 1.0407
dispersion: -0.026649594 hartree
energy: -1860.400011294123 hartree
dipole: 17.32024 -16.62810 0.69214 2.19955 -4.00817 -1.80862 2.02055 1.91005 3.93060
magnitude: 4.38175 au
magnitude: 11.13753 debye
