program: Orca
programVersion: 5.0.2
elementType: S S O O O O N N N N C C C C C C C C C C C C C C H H H H H H H H H H H H H H H H H
charge: -1
multiplicity: 1
keywords: wb97x-d3
keywords: def2-TZVPP
keywords: def2/J RIJCOSX
keywords: DEFGRID2
keywords: scfconv7
keywords: smallprint printgap noloewdin
keywords: NOSOSCF
formula: C14H17N4O4S2
InChI: InChI=1/C14H17N4O4S2/c1-3-21-13(19)17-11(23)15-9-7-5-6-8-10(9)16-12(24)18-14(20)22-4-2/h5-8,15-17H,3-4H2,1-2H3
41 atoms
S  0.566533 -2.181323 2.397765
S  -0.54169 1.677061 -2.457035
O  1.068164 -2.244554 -1.752667
O  2.836655 2.20965 0.814787
O  2.068737 -0.86281 -0.30745
O  0.918328 1.691722 1.860637
N  -1.621886 -1.000788 1.566536
N  -1.112075 1.345289 0.139666
N  -0.161073 -1.435443 -0.111555
N  0.994052 2.107537 -0.391505
C  -2.592892 -0.462762 0.710091
C  -2.3483 0.702706 -0.030346
C  -3.855219 -1.046733 0.646806
C  -3.351046 1.242646 -0.825558
C  -4.853194 -0.503044 -0.145013
C  -4.596817 0.638788 -0.890997
C  -0.39467 -1.493475 1.173937
C  -0.253157 1.692919 -0.818566
C  1.067264 -1.474599 -0.645554
C  1.542635 1.967491 0.859187
C  2.254073 -2.275587 -2.540214
C  3.601103 2.028131 2.021989
C  2.053063 -3.299501 -3.63138
C  3.934753 0.577056 2.274061
H  -4.044317 -1.945341 1.22134
H  -3.160096 2.151266 -1.377809
H  -1.939763 -1.316519 2.469688
H  -0.732957 1.317849 1.085101
H  -5.82605 -0.975733 -0.183373
H  -5.369453 1.072951 -1.511751
H  1.629619 2.331987 -1.145637
H  3.119616 -2.542404 -1.928977
H  2.446577 -1.288736 -2.971719
H  3.075645 2.471881 2.868125
H  4.506891 2.6074 1.85087
H  1.891442 -4.296087 -3.218999
H  1.20585 -3.049547 -4.270703
H  2.942864 -3.3407 -4.260191
H  4.577911 0.519674 3.153249
H  3.051654 -0.03122 2.469902
H  4.479458 0.142277 1.436203
elementType: S O N C H
totalener: -1860.37530188 hartree
nucrepener: 2531.60528766 hartree
electener: -4391.98058954 hartree
oneelecener: -7615.86930954 hartree
twoeener: 3223.88872001 hartree
cpcmener: -0.10932366 hartree
kineticenergy: 1854.66023336 hartree
xcener: -138.322966562235 hartree
chargesum: -1.0000000
charge: -0.594940 -0.444685 -0.312825 -0.301343 -0.529710 -0.466857 -0.177385 -0.144164 -0.417063 -0.144781 0.105628 0.168363 -0.200723 -0.179093 -0.140675 -0.149195 0.188525 0.211311 0.445144 0.507941 0.053831 0.049294 -0.254450 -0.249964 0.143342 0.133721 0.147117 0.195278 0.154448 0.154176 0.176659 0.079207 0.081634 0.093989 0.108744 0.084407 0.085525 0.082759 0.098516 0.068951 0.089346
qa: -0.5949 -0.4447 -0.3128 -0.3013 -0.5297 -0.4669 -0.1774 -0.1442 -0.4171 -0.1448 0.1056 0.1684 -0.2007 -0.1791 -0.1407 -0.1492 0.1885 0.2113 0.4451 0.5079 0.0538 0.0493 -0.2545 -0.2500 0.1433 0.1337 0.1471 0.1953 0.1544 0.1542 0.1767 0.0792 0.0816 0.0940 0.1087 0.0844 0.0855 0.0828 0.0985 0.0690 0.0893
va: 1.8064 1.9494 2.0425 2.1217 1.9408 2.0325 3.0865 3.2736 2.8442 3.2275 3.8640 3.7129 3.9898 4.0034 3.9093 3.9289 4.3627 4.3111 4.4264 4.2964 3.8557 3.8410 3.9730 3.9037 1.0069 1.0371 1.0513 1.0502 0.9905 0.9921 1.0390 1.0003 0.9996 1.0089 0.9951 1.0040 1.0038 1.0069 1.0118 1.0404 1.0074
dispersion: -0.024234108 hartree
energy: -1860.399535988106 hartree
dipole: 11.09219 -11.65492 -0.56273 -5.06863 7.62455 2.55592 -3.95822 3.47814 -0.48008
magnitude: 2.66080 au
magnitude: 6.76323 debye
