program: Orca
programVersion: 5.0.2
elementType: S S O O O O N N N N C C C C C C C C C C C C C C H H H H H H H H H H H H H H H H H
charge: -1
multiplicity: 1
keywords: wb97x-d3
keywords: def2-TZVPP
keywords: def2/J RIJCOSX
keywords: DEFGRID2
keywords: scfconv7
keywords: smallprint printgap noloewdin
keywords: NOSOSCF
formula: C14H17N4O4S2
InChI: InChI=1/C14H17N4O4S2/c1-3-21-13(19)17-11(23)15-9-7-5-6-8-10(9)16-12(24)18-14(20)22-4-2/h5-8,15-17H,3-4H2,1-2H3
41 atoms
S  0.842592 3.101011 -0.313235
S  -0.878712 -2.954588 -0.183208
O  1.019164 -0.239774 -2.875742
O  2.696459 -1.019435 2.231092
O  2.053252 0.078529 -0.912093
O  0.916977 0.341458 2.396276
N  -1.464736 1.943331 0.122806
N  -1.239876 -0.647691 1.129758
N  -0.127284 0.752774 -1.275491
N  0.768332 -1.733615 1.431949
C  -2.538125 1.043318 0.01773
C  -2.434899 -0.269478 0.495847
C  -3.754585 1.480156 -0.497998
C  -3.529831 -1.121312 0.426138
C  -4.845153 0.628263 -0.56397
C  -4.728627 -0.678215 -0.110361
C  -0.251407 1.814018 -0.510708
C  -0.474472 -1.696326 0.824901
C  1.057504 0.231004 -1.608113
C  1.431957 -0.70068 2.046644
C  2.177825 -0.893586 -3.392101
C  3.561267 -0.033414 2.832031
C  3.25218 0.076229 -3.833459
C  4.009404 1.014902 1.841258
H  -3.835921 2.498443 -0.85722
H  -3.4487 -2.125898 0.814731
H  -1.688767 2.876548 0.43289
H  -0.788256 0.084888 1.673541
H  -5.781419 0.984084 -0.972935
H  -5.575083 -1.350244 -0.154939
H  1.32056 -2.542818 1.179795
H  1.816297 -1.459642 -4.250858
H  2.569499 -1.614169 -2.671285
H  4.409914 -0.611769 3.190951
H  3.070926 0.412323 3.697768
H  2.867628 0.787582 -4.565644
H  3.67633 0.635528 -3.000328
H  4.0632 -0.477822 -4.307641
H  4.514029 0.564764 0.986768
H  3.187765 1.632918 1.478556
H  4.723983 1.671994 2.337532
elementType: S O N C H
totalener: -1860.37645743 hartree
nucrepener: 2539.25109058 hartree
electener: -4399.62754802 hartree
oneelecener: -7631.85713886 hartree
twoeener: 3232.22959084 hartree
cpcmener: -0.12915177 hartree
kineticenergy: 1854.64473282 hartree
xcener: -138.322977536289 hartree
chargesum: -1.0000000
charge: -0.590174 -0.444099 -0.336584 -0.301609 -0.567237 -0.489653 -0.171910 -0.147381 -0.412131 -0.145785 0.103957 0.166213 -0.201989 -0.179389 -0.140509 -0.149328 0.190066 0.214160 0.448679 0.518203 0.052438 0.052608 -0.259984 -0.254611 0.148017 0.137098 0.153891 0.196965 0.160220 0.160052 0.181781 0.104092 0.076262 0.114729 0.096573 0.084275 0.081869 0.093492 0.091085 0.060531 0.105117
qa: -0.5902 -0.4441 -0.3366 -0.3016 -0.5672 -0.4897 -0.1719 -0.1474 -0.4121 -0.1458 0.1040 0.1662 -0.2020 -0.1794 -0.1405 -0.1493 0.1901 0.2142 0.4487 0.5182 0.0524 0.0526 -0.2600 -0.2546 0.1480 0.1371 0.1539 0.1970 0.1602 0.1601 0.1818 0.1041 0.0763 0.1147 0.0966 0.0843 0.0819 0.0935 0.0911 0.0605 0.1051
va: 1.8120 1.9509 2.0282 2.1234 1.8909 2.0054 3.0938 3.2778 2.8516 3.2298 3.8443 3.7162 3.9886 3.9976 3.9022 3.9222 4.3557 4.3042 4.4414 4.2813 3.8558 3.8294 3.9083 3.9041 1.0058 1.0343 1.0453 1.0474 0.9888 0.9904 1.0343 0.9968 1.0181 0.9954 1.0085 1.0055 1.0194 1.0083 1.0060 1.0411 1.0114
dispersion: -0.024636351 hartree
energy: -1860.401093784900 hartree
dipole: 13.94360 -14.74895 -0.80534 1.46669 -3.27781 -1.81111 -4.11858 6.12017 2.00159
magnitude: 2.81692 au
magnitude: 7.16005 debye
