program: Orca
programVersion: 5.0.2
elementType: S S O O O O N N N N C C C C C C C C C C C C C C H H H H H H H H H H H H H H H H H
charge: -1
multiplicity: 1
keywords: wb97x-d3
keywords: def2-TZVPP
keywords: def2/J RIJCOSX
keywords: DEFGRID2
keywords: scfconv7
keywords: smallprint printgap noloewdin
keywords: NOSOSCF
formula: C14H17N4O4S2
InChI: InChI=1/C14H17N4O4S2/c1-3-21-13(19)17-11(23)15-9-7-5-6-8-10(9)16-12(24)18-14(20)22-4-2/h5-8,15-17H,3-4H2,1-2H3
41 atoms
S  0.548966 -2.141072 2.487459
S  -0.470708 1.512342 -2.477692
O  1.02594 -2.233777 -1.750713
O  2.855914 2.214189 0.805626
O  2.042727 -0.939082 -0.231651
O  0.938818 1.675719 1.845095
N  -1.634889 -0.997103 1.604602
N  -1.086244 1.312299 0.12164
N  -0.188047 -1.528772 -0.056764
N  1.020289 2.07556 -0.411046
C  -2.592031 -0.470059 0.722676
C  -2.324407 0.670667 -0.045524
C  -3.859531 -1.041809 0.662256
C  -3.310933 1.199595 -0.867941
C  -4.841549 -0.508845 -0.156851
C  -4.562752 0.608782 -0.931275
C  -0.413781 -1.506876 1.238064
C  -0.21239 1.616876 -0.838511
C  1.031824 -1.527506 -0.597043
C  1.565541 1.954533 0.843618
C  2.21341 -2.235083 -2.540875
C  3.614203 2.048942 2.021791
C  2.006313 -3.207721 -3.676732
C  3.938894 0.599299 2.294543
H  -4.067311 -1.919274 1.261724
H  -3.103082 2.091807 -1.440436
H  -1.959309 -1.260934 2.52227
H  -0.719748 1.317893 1.07135
H  -5.81981 -0.969388 -0.193171
H  -5.323762 1.035444 -1.570772
H  1.660183 2.290379 -1.164664
H  3.076405 -2.534888 -1.94204
H  2.409555 -1.23036 -2.926077
H  3.085499 2.509435 2.85662
H  4.522564 2.621153 1.846371
H  1.827256 -4.218515 -3.308408
H  1.168637 -2.918163 -4.311876
H  2.900689 -3.235676 -4.298657
H  4.575422 0.549226 3.178362
H  3.051471 -0.002591 2.492021
H  4.487755 0.152864 1.465591
elementType: S O N C H
totalener: -1860.37732560 hartree
nucrepener: 2535.42302634 hartree
electener: -4395.80035194 hartree
oneelecener: -7624.12879954 hartree
twoeener: 3228.32844760 hartree
cpcmener: -0.13012254 hartree
kineticenergy: 1854.65050450 hartree
xcener: -138.324044907852 hartree
chargesum: -1.0000000
charge: -0.583893 -0.444414 -0.327046 -0.301125 -0.565636 -0.488386 -0.166635 -0.143194 -0.427505 -0.147122 0.101019 0.165507 -0.201563 -0.182279 -0.139855 -0.148838 0.184444 0.211922 0.456905 0.518131 0.050692 0.052563 -0.253643 -0.252814 0.147836 0.138385 0.154643 0.198366 0.160526 0.160169 0.182092 0.082682 0.083749 0.097204 0.113678 0.085073 0.085948 0.086852 0.104278 0.059402 0.091883
qa: -0.5839 -0.4444 -0.3270 -0.3011 -0.5656 -0.4884 -0.1666 -0.1432 -0.4275 -0.1471 0.1010 0.1655 -0.2016 -0.1823 -0.1399 -0.1488 0.1844 0.2119 0.4569 0.5181 0.0507 0.0526 -0.2536 -0.2528 0.1478 0.1384 0.1546 0.1984 0.1605 0.1602 0.1821 0.0827 0.0837 0.0972 0.1137 0.0851 0.0859 0.0869 0.1043 0.0594 0.0919
va: 1.8205 1.9482 2.0254 2.1238 1.8962 2.0062 3.0990 3.2707 2.8342 3.2314 3.8443 3.7048 3.9856 3.9983 3.9022 3.9223 4.3708 4.3075 4.4214 4.2808 3.8468 3.8292 3.9720 3.9044 1.0059 1.0323 1.0447 1.0460 0.9886 0.9904 1.0340 1.0009 1.0009 1.0082 0.9957 1.0042 1.0039 1.0067 1.0118 1.0408 1.0062
dispersion: -0.024399307 hartree
energy: -1860.401724906850 hartree
dipole: 10.93137 -11.69721 -0.76584 -4.29716 7.16309 2.86593 -4.24089 3.71102 -0.52988
magnitude: 3.01344 au
magnitude: 7.65956 debye
