program: Gaussian 09
title: 000070810
version: EM64L-G09RevD.01
frameworkgroup: C1[X(C11H8O3)]
method: RPBEPBE
basis: SDD
operation: Freq
keyword: #pfreq=noraman
keyword: PBEPBE/SDD
title: #p freq=noraman PBEPBE/SDD
converged: YES YES NO NO
title: Mulliken charges:
elementType: O O O C C C C C C C C C C C H H H H H H H H
charge: -0.145397 -0.171206 -0.172584 -0.432142 0.256473 0.241163 -0.012541 -0.004180 0.234290 -0.360393 -0.364750 -0.205674 -0.205267 -0.773712 0.291848 0.280497 0.278626 0.243223 0.242970 0.279259 0.243122 0.256373
chargesum: 0.00000
title: Mulliken charges with hydrogens summed into heavy atoms:
elementType: O O O C C C C C C C C C C C
charge: -0.145397 -0.171206 -0.172584 -0.140294 0.256473 0.241163 -0.012541 -0.004180 0.234290 -0.079896 -0.086124 0.037550 0.037703 0.005042
polarizability: 1.72182706e+02 -2.20622794e-01 1.32341074e+02 -1.32194387e+01 9.32715994e-01 7.28788743e+01
1716.lowfreq: -9.2883 -0.0007 -0.0004 0.0005 6.8751 8.3770 38.3032 56.6228 113.9093
frequency: 38.1900 56.6022 113.9019 131.8315 146.4243 172.1393 199.0415 236.7259 289.7275 332.4503 402.1709 434.8953 499.2785 518.5508 521.0093 527.2230 571.0815 609.6491 660.6846 684.2234 755.1924 772.0304 785.9738 818.5672 869.8400 911.3146 942.1583 972.9177 986.4012 1008.5938 1013.6347 1030.2139 1068.3895 1082.4498 1146.5861 1153.0677 1173.4492 1187.4556 1216.0532 1251.0393 1281.4896 1372.1173 1409.6077 1445.6843 1450.8412 1452.7658 1454.2451 1591.3675 1598.3017 1627.2814 1632.2471 1669.1439 2976.4501 3044.4186 3060.5273 3125.7028 3139.7397 3153.5971 3165.5280 3174.5557
redmass: 7.0671 4.1693 4.4121 7.3128 7.1593 1.0756 6.2390 6.9285 3.9952 7.2963 3.3971 4.6183 4.5406 4.2682 6.7610 6.5501 5.3900 3.7549 5.3225 5.0688 2.8733 4.0055 1.6973 4.2935 3.2835 1.4501 3.7023 2.3167 1.5157 2.4081 1.3660 1.8698 3.3575 2.4480 1.4198 2.0793 1.1237 2.0243 1.8066 3.9945 1.6083 1.2460 7.6824 1.0606 1.1817 2.0360 2.5600 7.4626 7.6537 10.3399 8.9546 11.1264 1.0374 1.0839 1.0961 1.1003 1.0866 1.0904 1.0957 1.1004
irintensity: 6.8472 5.5274 0.5350 0.6220 2.7487 0.5868 1.2365 0.1080 5.6283 4.5820 2.5801 0.7293 4.1055 13.7181 2.1383 1.0543 43.1084 1.0192 0.0420 1.1090 16.9369 1.7362 77.3128 0.3255 1.9602 0.2966 31.7623 4.9758 3.4450 9.8831 0.0265 6.3116 75.9388 3.1385 27.9970 196.5563 6.6658 39.6906 189.6482 164.8300 2.8077 84.9443 5.8697 22.6063 20.6197 8.6136 0.2102 161.2541 3.0440 205.8689 115.6560 93.6526 2.3840 1.0361 2.8145 10.5700 1.8023 4.2801 4.2148 20.7139
temp: 298.150 k
press: 1.00000 atm
elementType: 8 8 8 6 6 6 6 6 6 6 6 6 6 6 1 1 1 1 1 1 1 1
symmnumber: 1
zpe: 419391.2 jmol-1
zpe.correction: 0.159738 hartree
zpe.thermalcorrener: 0.171690 hartree
zpe.thermalcorrenthalpy: 0.172634 hartree
zpe.thermalcorrgfe: 0.120818 hartree
zpe.sumelectzpe: -648.664262 hartree
zpe.sumelectthermal: -648.652310 hartree
zpe.sumelectthermalent: -648.651366 hartree
zpe.sumelectthermalfe: -648.703182 hartree
dipole: -2.8638 -1.7317 -0.9444
dipole: 3.4774
quadrupole: -59.0488 -90.9081 -84.9463
quadrupole: -2.0697 -6.5917 -2.2941
quadrupole: 19.2523 -12.6070 -6.6453 -2.0697 -6.5917 -2.2941
hfenergy: -648.8240001 hartree
pointgroup: C01 [X(C11H8O3)]
dipole: 1.1533373 -0.6574611 0.3305517 debye
dipolederiv: -0.5265008 0.1389195 0.081637 0.1687314 -0.9052621 -0.2435679 0.1072727 -0.1588682 -0.3409459 -0.6053274 -0.2150855 0.0813448 -0.1476396 -0.979319 0.1986296 0.092162 0.0691533 -0.3082881 -0.4951383 -0.0752173 0.0315235 0.0123254 -0.399908 0.2452823 -0.3911217 0.2873839 -0.76517 -1.1854627 0.0659874 -0.3498535 0.1504691 -0.470573 0.0785489 -0.4374424 0.0311447 -0.1420476 -0.4658199 0.2416875 0.1264924 0.3173609 -0.1523443 -0.1181855 0.1724693 -0.0764157 -0.0004144 -0.5869648 -0.2425699 0.1035938 -0.2587604 -0.1221618 0.1014767 0.1560245 0.0476538 0.0129021 1.1954534 -0.2277609 -0.2193454 -0.0080496 1.1210365 0.338265 -0.329468 0.2038602 0.1911903 1.3812426 0.2444019 -0.1855653 -0.1646783 1.2026248 -0.2841207 -0.3817197 -0.0658869 0.1124359 1.351312 0.213451 0.2007811 0.1960228 0.3119885 -0.3529362 0.9125078 -0.3636561 0.9813688 -0.1329729 -0.0732229 -0.0012972 0.1228043 0.1407055 -0.014622 0.0342913 0.0145357 -0.0988523 -0.0861338 0.1315941 0.0058543 -0.1173538 0.1291985 0.0228879 0.0057142 -0.0115759 -0.0998821 0.114284 0.105412 -0.0725979 0.1167932 -0.0429675 -0.0263074 -0.0664711 -0.0248143 -0.1061098 0.0740806 -0.1295006 -0.0748555 -0.1470619 -0.0540727 0.0349323 -0.0729246 0.0407674 -0.1063464 -0.4233396 -0.1958682 0.0850271 -0.202088 -0.1369633 0.1082675 0.065417 0.0955347 -0.0680321 0.0950068 -0.0176919 0.0872478 -0.0545759 0.0679404 -0.0080574 0.0997436 0.0025743 0.0365634 0.1028087 0.0120065 0.0161039 -0.0350008 -0.0154967 -0.0020514 0.0126409 -0.0102069 0.1551912 0.1095646 -0.0288124 0.0189267 0.0170463 -0.020892 -0.0151628 0.0157031 -0.0037831 0.1540394 -0.0581753 -0.0664899 0.0522107 -0.0725041 0.0606592 0.0143755 0.0546291 0.0169156 0.1413625 -0.0439588 0.0743903 0.0542444 0.0788525 0.046081 -0.0284401 0.0578926 -0.0295073 0.1390553 0.1394674 0.0793032 -0.0091456 0.0098634 0.0231413 0.0309369 -0.0388307 0.0234449 0.1230905 0.0629968 -0.0054286 0.0412424 0.0399131 0.0808385 -0.0922184 0.0537177 -0.0806195 0.0010712 -0.0164227 -0.0295053 -0.0735694 -0.0224701 0.1157465 0.0120673 -0.1222075 -0.0076346 -0.012182 unknown
polarizability: 171.3646384|1.4490749|132.4046731|-15.8193122|-0.394952|73.6333426 unknown
InChI: InChI=1S/C11H8O3/c1-6(12)9-10(13)7-4-2-3-5-8(7)11(9)14/h2-5,9H,1H3
charge 0 multiplicity 1
22 atoms
O  -0.629474 2.484509 0.912064
O  -0.922378 -2.344257 0.646969
O  -2.261596 0.784644 -1.466774
C  -1.390266 0.115755 0.725578
C  0.932197 0.713042 0.224772
C  0.851088 -0.703063 0.166459
C  -0.382527 1.284342 0.644576
C  -0.520132 -1.158525 0.532593
C  -2.469898 0.166132 -0.396773
C  2.135526 1.385741 -0.069976
C  1.970728 -1.485565 -0.186317
C  3.25915 0.606062 -0.427972
C  3.177811 -0.813998 -0.485232
C  -3.726137 -0.627847 -0.103969
H  -1.907242 0.081716 1.701384
H  2.184924 2.477875 -0.021505
H  1.895121 -2.576696 -0.225528
H  4.209267 1.096984 -0.664939
H  4.066516 -1.390012 -0.764891
H  -3.449824 -1.65482 0.20423
H  -4.273686 -0.170919 0.742469
H  -4.379068 -0.657498 -0.989417
