program: Gaussian 09
title: 000070825
version: EM64L-G09RevD.01
frameworkgroup: C1[X(C14H22O)]
method: RPBEPBE
basis: SDD
operation: Freq
keyword: #pfreq=noraman
keyword: PBEPBE/SDD
title: #p freq=noraman PBEPBE/SDD
converged: YES YES NO NO
title: Mulliken charges:
elementType: O C C C C C C C C C C C C C C H H H H H H H H H H H H H H H H H H H H H H
charge: -0.446300 0.109454 0.115361 0.571448 0.547972 -0.639973 -0.699957 -0.699952 -0.749227 -0.701260 -0.701276 -0.746311 -0.652372 -0.587835 0.307452 0.222752 0.206145 0.217641 0.222322 0.217642 0.206146 0.222322 0.219444 0.214701 0.214689 0.206420 0.215266 0.223509 0.215237 0.206422 0.223514 0.215486 0.218393 0.218408 0.242300 0.273526 0.350491
chargesum: 0.00000
title: Mulliken charges with hydrogens summed into heavy atoms:
elementType: O C C C C C C C C C C C C C C
charge: -0.095808 0.109454 0.115361 0.571448 0.547972 -0.417221 -0.053849 -0.053842 -0.100394 -0.056064 -0.056103 -0.094023 -0.410071 -0.314310 0.307452
polarizability: 1.87231847e+02 1.96232162e+00 1.67250379e+02 8.15000945e-03 1.70487747e-03 1.11186301e+02
1716.lowfreq: -12.6545 -11.2784 -7.5627 -0.0005 0.0002 0.0007 28.2870 37.0235 88.2763
frequency: 27.4875 36.9331 88.2048 130.0632 147.2470 197.4836 199.2853 213.8332 222.7204 248.0980 251.5256 264.4355 289.8380 298.2853 302.4559 303.3301 307.9952 332.7201 351.8854 366.7750 379.6971 397.2399 403.3946 428.3606 514.3572 526.5391 541.5891 547.1608 606.8635 638.9059 711.6575 756.5360 805.1995 849.7024 887.8277 891.5212 894.3936 919.3550 920.4725 931.7926 933.0511 939.3401 944.8173 946.7486 987.9633 1021.1715 1022.3350 1027.4213 1027.7687 1124.4927 1129.3907 1156.2987 1204.9340 1205.5326 1213.1035 1215.6462 1221.7561 1250.5846 1296.1877 1314.5067 1374.8016 1375.5036 1376.7205 1376.9758 1382.4825 1403.9732 1404.7099 1423.6964 1458.7056 1459.6276 1462.2873 1465.2479 1465.8657 1470.1125 1476.7744 1481.4959 1485.6829 1486.5942 1486.8921 1498.1119 1498.6938 1599.2841 1620.2111 2971.7921 2973.3005 2973.6306 2973.7573 2978.2715 2978.9701 3066.8119 3067.2587 3068.3005 3068.6373 3068.7272 3072.5228 3076.2286 3076.9771 3080.2683 3080.5510 3082.9214 3084.0119 3125.6626 3131.4712 3180.6379 3577.9648
redmass: 2.7076 3.0996 3.4016 3.3698 2.6840 1.0889 1.0418 2.9862 4.2730 1.1129 1.3131 2.0960 2.7029 2.6603 1.0918 2.4205 1.0588 2.4039 1.1221 2.5823 2.3521 2.6617 3.1761 2.8367 2.9623 4.4961 3.3599 3.2379 4.1343 4.2965 1.8645 4.5399 3.0952 1.5468 1.7776 1.4223 2.5850 1.7259 1.6915 1.6530 1.6422 4.1295 1.1973 1.2025 6.1839 1.4287 1.3889 1.3839 1.3878 1.6084 1.6169 1.3797 2.9686 2.9490 2.7666 2.6572 1.9167 2.6920 1.3159 4.7141 1.3055 1.1853 1.1851 1.3436 3.6320 1.2017 1.2244 3.0592 1.0505 1.0503 1.0481 1.0480 1.0758 1.0816 1.2984 1.0668 1.0509 1.0511 1.5040 1.1619 1.0889 5.9622 6.2470 1.0350 1.0347 1.0349 1.0348 1.0359 1.0358 1.1000 1.0999 1.0996 1.0997 1.1001 1.1005 1.0985 1.0983 1.0994 1.0995 1.0990 1.0988 1.0887 1.0901 1.0910 1.0659
irintensity: 0.0027 0.0114 1.0422 0.1405 0.7889 0.1508 0.0024 2.2013 0.8045 0.0336 0.9322 0.2605 0.2707 1.1201 1.0228 0.4682 0.3298 0.7092 131.5808 0.0971 0.0792 0.3059 6.6907 0.4414 2.2733 0.7376 5.8949 1.7807 0.2878 0.9173 22.5950 0.4260 0.4900 15.9684 24.1360 1.1355 20.8740 0.0810 7.0141 5.6294 7.6286 72.5994 0.0047 1.0568 0.6410 7.5834 3.1039 0.0003 0.1790 2.1187 63.6067 122.8888 0.0347 11.9622 9.2047 1.9657 1.3230 80.8161 26.2701 30.6297 9.4865 3.5602 34.3355 18.2494 11.4339 15.9352 5.1839 42.7055 0.0000 0.0333 0.0003 0.3860 0.2615 6.0237 0.1822 15.3941 3.3323 18.3197 5.7969 39.9320 16.6718 123.0386 63.6330 29.1790 15.4087 51.1277 31.2119 42.6064 22.8940 0.0126 4.0647 9.0030 4.0868 33.0189 14.4990 154.0023 88.2620 32.8668 23.4677 46.0610 51.9344 29.1321 5.6370 2.9822 27.6944
temp: 298.150 k
press: 1.00000 atm
elementType: 8 6 6 6 6 6 6 6 6 6 6 6 6 6 6 1 1 1 1 1 1 1 1 1 1 1 1 1 1 1 1 1 1 1 1 1 1
symmnumber: 1
zpe: 847012.0 jmol-1
zpe.correction: 0.322610 hartree
zpe.thermalcorrener: 0.339752 hartree
zpe.thermalcorrenthalpy: 0.340696 hartree
zpe.thermalcorrgfe: 0.279198 hartree
zpe.sumelectzpe: -620.744258 hartree
zpe.sumelectthermal: -620.727116 hartree
zpe.sumelectthermalent: -620.726172 hartree
zpe.sumelectthermalfe: -620.787671 hartree
dipole: 1.5445 -0.7235 0.0002
dipole: 1.7056
quadrupole: -85.8932 -91.5587 -96.8410
quadrupole: 6.8983 0.0013 0.0010
quadrupole: 5.5377 -0.1277 -5.4101 6.8983 0.0013 0.0010
hfenergy: -621.0668683 hartree
pointgroup: C01 [X(C14H22O1)]
dipole: -0.6057974 0.2885819 0.000076 debye
polarizability: 187.2565504|1.8320735|167.2256759|-0.0081609|-0.0016518|111.1863006 unknown
InChI: InChI=1S/C14H22O/c1-13(2,3)10-7-11(14(4,5)6)9-12(15)8-10/h7-9,15H,1-6H3
charge 0 multiplicity 1
37 atoms
O  0.043782 -3.553465 0.000188
C  -2.559676 0.79272 0.000345
C  2.573947 0.746102 -0.000138
C  -1.244013 -0.026089 0.000272
C  1.24495 -0.050617 -0.000063
C  0.005801 0.645156 0.000094
C  -2.609002 1.693536 -1.270818
C  -2.608989 1.693433 1.271583
C  -3.820411 -0.109683 0.000323
C  2.637637 1.645464 1.271497
C  2.637038 1.646511 -1.27105
C  3.817388 -0.179438 -0.000842
C  -1.240669 -1.443203 0.000304
C  1.220413 -1.464556 -0.000027
C  -0.014592 -2.143948 0.000159
H  0.015582 1.741239 0.000066
H  -3.537908 2.294919 -1.278316
H  -1.752872 2.3900 -1.308696
H  -2.58507 1.078789 -2.18917
H  -1.752962 2.390021 1.309438
H  -3.537976 2.294688 1.279224
H  -2.584884 1.078615 2.189883
H  -4.727338 0.52221 0.000499
H  -3.862168 -0.754244 -0.897488
H  -3.861995 -0.75453 0.897937
H  3.576963 2.230332 1.279444
H  1.793631 2.356816 1.309731
H  2.603468 1.030047 2.189038
H  1.79314 2.35804 -1.308258
H  3.576441 2.231256 -1.279021
H  2.602294 1.031858 -2.189083
H  4.736338 0.435175 -0.000903
H  3.845614 -0.826343 0.895286
H  3.845049 -0.825731 -0.89743
H  -2.183315 -2.003201 0.000443
H  2.135532 -2.060867 -0.000164
H  -0.867167 -3.939613 0.000314
