program: Gaussian 09
title: 000070813
version: EM64L-G09RevD.01
frameworkgroup: C1[X(C12H8S2)]
method: RPBEPBE
basis: SDD
operation: Freq
keyword: #pfreq=noraman
keyword: PBEPBE/SDD
title: #p freq=noraman PBEPBE/SDD
converged: YES YES NO NO
title: Mulliken charges:
elementType: S S C C C C C C C C C C C C H H H H H H H H
charge: 0.223859 0.241441 -0.058645 -0.082966 -0.283463 -0.292458 -0.285255 -0.190116 -0.132958 -0.511021 0.082824 0.018228 -0.157141 -0.547603 0.253941 0.255027 0.265868 0.247726 0.268025 0.230891 0.220043 0.233754
chargesum: 0.00000
title: Mulliken charges with hydrogens summed into heavy atoms:
elementType: S S C C C C C C C C C C C C
charge: 0.223859 0.241441 -0.058645 -0.082966 -0.029522 -0.037431 -0.019387 -0.190116 0.114768 -0.242996 0.082824 0.018228 0.073750 -0.093806
polarizability: 4.83510008e+02 -1.05776808e+01 1.49297314e+02 -8.57831147e-02 2.15174918e-02 5.92333873e+01
1716.lowfreq: -0.0023 -0.0017 0.0009 2.7418 5.1648 14.4487 29.1346 38.9219 45.1648
frequency: 29.1277 38.8961 45.1501 69.4604 118.7780 122.4670 175.3324 204.1270 251.4382 295.3431 338.8189 409.5530 428.3225 460.1588 480.9884 539.7538 556.9441 568.8540 594.4434 609.5403 647.2087 670.8046 678.2093 686.8425 689.4625 790.9046 816.2651 823.3905 845.0319 879.9984 905.6915 908.2233 935.7354 972.6490 1041.1319 1056.4516 1079.9274 1090.0523 1179.7925 1207.1546 1224.1585 1272.8692 1278.5495 1316.6600 1361.5621 1420.1614 1465.4866 1482.7599 1516.3114 1569.5111 1612.9887 2206.9991 3090.6830 3112.0893 3166.3514 3168.5145 3187.4737 3194.3589 3223.9366 3239.0870
redmass: 5.9266 4.6024 5.1727 3.0342 5.2762 4.0813 5.5406 4.3533 8.8648 4.3189 9.6198 5.6234 7.5932 5.9976 5.0821 4.4099 5.0405 3.4480 3.8199 6.7571 9.1803 1.8618 7.8360 6.7670 1.1639 5.3973 1.2938 1.3296 5.1201 4.2703 1.4115 1.3706 1.3196 1.1460 1.5940 1.6993 1.4580 1.1761 1.9862 1.9548 2.7514 1.8451 1.2713 2.4434 2.9936 1.4461 7.0006 4.9446 4.3689 6.8670 4.8995 11.9229 1.0815 1.0668 1.0910 1.0909 1.0963 1.0993 1.1165 1.1002
irintensity: 0.1369 1.1636 0.5525 1.2798 0.9754 0.1426 0.2835 4.9528 1.3689 1.1171 0.6112 1.3724 1.5394 2.0834 6.1286 4.8210 4.0063 0.7644 0.0001 5.3650 0.7227 5.6350 0.0714 2.9952 106.2201 45.7597 65.1557 26.3179 4.3042 0.2847 0.0791 0.0972 92.1266 15.4782 12.9011 13.1578 15.9432 0.2246 15.8286 25.0180 8.4885 0.7198 0.5434 0.3982 0.1247 3.3440 10.0556 45.8580 4.5083 0.3934 57.3025 42.2581 18.0625 3.2805 9.3543 12.1556 6.6126 1.4501 16.4461 0.7837
temp: 298.150 k
press: 1.00000 atm
elementType: 16 16 6 6 6 6 6 6 6 6 6 6 6 6 1 1 1 1 1 1 1 1
symmnumber: 1
zpe: 402860.0 jmol-1
zpe.correction: 0.153441 hartree
zpe.thermalcorrener: 0.166835 hartree
zpe.thermalcorrenthalpy: 0.167780 hartree
zpe.thermalcorrgfe: 0.110980 hartree
zpe.sumelectzpe: -1257.146687 hartree
zpe.sumelectthermal: -1257.133293 hartree
zpe.sumelectthermalent: -1257.132349 hartree
zpe.sumelectthermalfe: -1257.189149 hartree
dipole: 0.4978 -0.0883 -0.0012
dipole: 0.5055
quadrupole: -73.1260 -86.1174 -103.6305
quadrupole: -2.0705 -0.0197 -0.0011
quadrupole: 14.4987 1.5072 -16.0059 -2.0705 -0.0197 -0.0011
hfenergy: -1257.3001288 hartree
pointgroup: C01 [X(C12H8S2)]
dipole: -0.1969935 -0.0262136 0.0080769 debye
dipolederiv: -0.0305947 -0.0104416 0.0036241 -0.0011657 -0.2044864 0.0603545 0.0019979 0.0607692 0.0948223 0.0760967 -0.0717 0.0147153 0.1133624 -0.255162 0.0749715 -0.0235867 0.0768049 0.1121947 0.2080066 -0.0751468 0.0112014 0.3172142 0.2050969 -0.0580193 -0.0655335 -0.0534812 -0.0648953 0.3022938 -0.1304967 0.0217369 -0.2672836 0.2250769 -0.0667677 0.0503589 -0.067715 -0.1091889 -0.2782469 -0.0556241 0.0121768 -0.4376029 -0.1483745 0.0035903 0.0860266 -0.0015036 -0.160965 0.108719 -0.0710732 0.0111908 -0.046702 -0.1965392 0.0065704 0.005939 0.0069301 -0.1669247 0.1462187 0.0598872 -0.0153148 0.1069114 -0.0585823 -0.0181876 -0.0230195 -0.0175844 -0.142343 0.0444283 0.0878041 -0.0188377 0.1789514 0.260975 -0.0705724 -0.0369435 -0.0693536 -0.076228 -0.2039427 0.1128782 -0.0215072 0.3631494 -0.0888117 -0.0127159 -0.0724185 -0.0099911 -0.1290517 -0.5191156 0.1298119 -0.0235419 -0.2201593 0.2262835 -0.1059972 0.0465548 -0.1100045 -0.2980428 0.3095669 -0.077934 0.0111534 -0.2010799 -0.1301203 0.0242014 0.0352189 0.022674 -0.0228703 -0.5211943 0.002777 0.0052396 0.3668762 -0.1203332 0.0047237 -0.0678717 0.0096499 -0.0735832 0.7431128 -0.0475996 -0.0025218 -0.3256539 0.1681034 -0.048819 0.0529263 -0.0526534 -0.0933179 -0.5470554 -0.0367355 0.0085638 -0.1167032 0.0486171 -0.0865839 0.0247474 -0.0877663 -0.3832553 0.0243661 0.0824255 -0.0138961 0.0940088 0.0261443 0.0309403 -0.0163546 0.031266 0.1866708 0.0785417 0.076672 -0.0139903 0.1127308 0.0263367 0.0327895 -0.0210344 0.0330503 0.1908174 0.0472653 -0.0615505 0.0136667 -0.087473 0.0118779 0.0355902 0.01873 0.035335 0.1829633 0.0236779 -0.0635214 0.0146024 -0.1249694 -0.0088488 0.0417863 0.0267911 0.0410711 0.1853842 0.0064177 0.0205414 -0.0016344 -0.0059296 0.0912575 0.026879 0.0042174 0.0265708 0.2205164 0.0001621 0.0264714 -0.0026699 0.0964481 -0.0666782 0.0465792 -0.0161273 0.0474814 0.1680435 -0.1039679 0.0647267 -0.0083068 0.0544621 0.0586711 0.025765 -0.0065612 0.0256762 0.1890189 0.0852439 0.0378282 -0.0056503 0.0306079 -0.0705037 0.0529217 -0.0040573 0.0527743 0.1902345 unknown
polarizability: 483.7643707|-3.1431997|145.6598398|-4.7823831|-16.9250952|62.6164993 unknown
InChI: InChI=1S/C12H8S2/c1-2-3-5-10-7-8-12(14-10)11-6-4-9-13-11/h2,4,6-9H,1H2
charge 0 multiplicity 1
22 atoms
S  0.103304 -0.997148 0.078961
S  -3.846452 1.208025 -0.310161
C  -1.169303 0.276423 -0.152632
C  -2.56794 -0.068293 -0.069407
C  -0.575103 1.520704 -0.401195
C  -3.168124 -1.305218 0.182992
C  0.850121 1.506301 -0.415687
C  1.420608 0.247473 -0.17898
C  -4.604667 -1.27349 0.192368
C  -5.133229 -0.014991 -0.051869
C  2.770411 -0.126574 -0.123656
C  3.967324 -0.466719 -0.07342
C  5.321463 -0.899972 -0.008445
C  6.421309 -0.102282 -0.181811
H  -1.165148 2.425724 -0.569011
H  -2.587412 -2.215254 0.357786
H  1.467096 2.389438 -0.594321
H  -5.225521 -2.153672 0.374504
H  -6.174059 0.299303 -0.10278
H  5.469813 -1.970116 0.199561
H  7.430993 -0.519795 -0.115006
H  6.327616 0.968231 -0.39109
