program: Gaussian 09
title: 000070797
version: EM64L-G09RevD.01
frameworkgroup: C1[X(C11H17N)]
method: RPBEPBE
basis: SDD
operation: Freq
keyword: #pfreq=noraman
keyword: PBEPBE/SDD
title: #p freq=noraman PBEPBE/SDD
converged: YES YES NO NO
title: Mulliken charges:
elementType: N C C C C C C C C C C C H H H H H H H H H H H H H H H H H
charge: -0.026008 -0.355633 -0.382621 -0.355935 -0.493494 -0.354769 0.180837 -0.696116 -0.354093 -0.181252 -0.364223 -0.189104 0.191984 0.186584 0.198436 0.227128 0.192015 0.187502 0.202131 0.221875 0.196120 0.193547 0.214910 0.209325 0.210755 0.238378 0.235245 0.236950 0.229529
chargesum: 0.00000
title: Mulliken charges with hydrogens summed into heavy atoms:
elementType: N C C C C C C C C C C C
charge: -0.026008 0.022935 0.042943 0.023581 -0.069488 0.034898 0.180837 -0.061125 -0.115715 0.053992 -0.127274 0.040424
polarizability: 1.63446335e+02 -5.88287666e+00 1.14907442e+02 1.46564576e+01 5.01672949e+00 8.99320462e+01
1716.lowfreq: -21.5428 -7.8393 -0.0008 -0.0007 -0.0004 3.7797 19.3851 32.6103 48.6025
frequency: 19.2007 31.7604 48.5714 67.1410 115.0576 124.8830 135.4674 218.6978 232.2769 247.1790 340.8661 384.0626 404.4231 426.5990 515.5615 596.4774 625.3577 723.1009 736.6093 750.3852 773.7194 787.6130 827.3372 873.1823 887.7956 897.2323 953.4887 958.2231 976.6018 997.8674 1010.5669 1013.5756 1040.1364 1059.1420 1065.2302 1077.9540 1110.8011 1114.4044 1163.1907 1190.4327 1222.3870 1232.9164 1241.9019 1271.8204 1281.7122 1283.5480 1290.2769 1299.6982 1316.9504 1326.1580 1342.7680 1351.2472 1388.5735 1413.2990 1454.2702 1457.2040 1462.6668 1465.0529 1473.3015 1477.0129 1481.7305 1487.7195 1563.9930 1581.1121 2949.9908 2954.8205 2966.0165 2970.5473 2971.0163 2987.4733 2989.0612 3003.6176 3024.6121 3036.7768 3060.3504 3067.4331 3069.9513 3121.6013 3131.8020 3149.0498 3167.7066
redmass: 4.0465 1.7222 3.8385 2.7016 1.7625 3.5669 2.2173 4.6579 1.1023 3.1740 2.4741 2.9914 3.5548 3.0907 2.9971 5.0142 5.8921 1.0643 1.1089 1.6266 2.1050 1.3158 4.0702 1.2581 1.9074 1.3327 1.4561 3.6896 1.4062 1.3454 3.7231 3.6808 2.3503 1.5034 2.7257 2.2437 1.4913 2.0809 1.0721 1.6956 1.3411 1.5378 1.8271 1.2163 1.4719 1.0828 1.1392 1.9563 1.7415 1.7389 1.5121 1.6647 1.2171 1.9438 2.0754 1.1509 1.0664 1.0825 1.0805 1.0426 1.0821 1.0879 5.7472 5.8530 1.0589 1.0588 1.0591 1.0567 1.0411 1.0884 1.0671 1.0998 1.1017 1.1030 1.1044 1.1008 1.0992 1.0881 1.0887 1.0947 1.1014
irintensity: 1.7539 0.0992 0.3979 0.5334 0.0195 0.7142 0.0989 0.9527 0.0034 0.9732 2.1263 0.8844 3.3670 0.2524 10.8967 4.6376 2.0640 11.8769 0.0193 40.2551 20.8302 5.9028 3.9678 1.3431 5.2346 0.0961 0.3186 1.6429 0.9829 0.1182 0.0944 0.3138 5.4169 2.3711 1.2171 0.9341 3.6523 21.1618 2.0428 0.3452 4.4059 7.2264 2.6894 1.2276 3.1797 0.2539 0.7699 2.1747 2.3710 0.4498 1.8925 0.9436 10.9936 16.8188 42.7019 6.9463 0.0632 1.4011 2.0553 12.2907 4.1140 24.3156 13.1519 57.3445 4.0563 11.7547 48.4697 40.3697 61.5568 5.0228 46.5476 2.3741 12.6874 39.4217 47.2072 107.9128 56.1662 17.7002 4.6196 31.5533 23.9768
temp: 298.150 k
press: 1.00000 atm
elementType: 7 6 6 6 6 6 6 6 6 6 6 6 1 1 1 1 1 1 1 1 1 1 1 1 1 1 1 1 1
symmnumber: 1
zpe: 665789.5 jmol-1
zpe.correction: 0.253586 hartree
zpe.thermalcorrener: 0.266587 hartree
zpe.thermalcorrenthalpy: 0.267532 hartree
zpe.thermalcorrgfe: 0.211431 hartree
zpe.sumelectzpe: -483.191077 hartree
zpe.sumelectthermal: -483.178075 hartree
zpe.sumelectthermalent: -483.177131 hartree
zpe.sumelectthermalfe: -483.233232 hartree
dipole: -0.7769 -1.5533 -0.9605
dipole: 1.9846
quadrupole: -65.7356 -71.8301 -76.3987
quadrupole: 1.2468 5.3163 0.0766
quadrupole: 5.5859 -0.5086 -5.0773 1.2468 5.3163 0.0766
hfenergy: -483.4446627 hartree
pointgroup: C01 [X(C11H17N1)]
dipole: -0.2967833 0.7212325 0.0373647 debye
polarizability: 163.5161314|-2.4627213|113.4409163|-15.4921808|-7.6129983|91.3287758 unknown
InChI: InChI=1S/C11H17N/c1-2-3-4-5-8-11-9-6-7-10-12-11/h6-7,9-10H,2-5,8H2,1H3
charge 0 multiplicity 1
29 atoms
N  -2.065328 -1.138606 0.016869
C  2.290159 0.000756 -0.640788
C  0.877257 0.066102 -0.020358
C  3.418785 0.013675 0.414606
C  -0.24625 0.08063 -1.093534
C  4.833496 -0.064308 -0.204092
C  -1.630083 0.068302 -0.474069
C  5.957815 -0.04063 0.853687
C  -2.422567 1.241922 -0.376171
C  -3.691583 1.175209 0.241209
C  -3.292133 -1.188306 0.610695
C  -4.140834 -0.065582 0.747694
H  2.375074 -0.918211 -1.257819
H  2.429177 0.856138 -1.33548
H  0.791339 0.971287 0.615371
H  0.714363 -0.80621 0.642166
H  3.278268 -0.836984 1.113763
H  3.338821 0.935802 1.027875
H  -0.12745 0.970064 -1.741803
H  -0.136884 -0.818612 -1.728821
H  4.914396 -0.989505 -0.810581
H  4.969396 0.781647 -0.908862
H  6.957619 -0.095947 0.384718
H  5.917402 0.887579 1.454826
H  5.864318 -0.89449 1.551283
H  -2.046045 2.18699 -0.782148
H  -4.317521 2.070642 0.322968
H  -3.600321 -2.172212 0.984654
H  -5.117783 -0.165143 1.231343
