program: Gaussian 09
title: 000070796
version: EM64L-G09RevD.01
frameworkgroup: C1[X(C10H18O2)]
method: RPBEPBE
basis: SDD
operation: Freq
keyword: #pfreq=noraman
keyword: PBEPBE/SDD
title: #p freq=noraman PBEPBE/SDD
converged: YES YES NO NO
title: Mulliken charges:
elementType: O O C C C C C C C C C C H H H H H H H H H H H H H H H H H H
charge: -0.223439 -0.233940 0.037885 -0.450326 -0.447155 -0.403942 -0.402090 -0.383397 -0.440406 -0.399047 -0.315300 0.010388 0.189725 0.187008 0.209173 0.196641 0.190712 0.190755 0.197859 0.197352 0.192284 0.192068 0.200541 0.199653 0.188322 0.227392 0.213013 0.234760 0.235433 0.208077
chargesum: 0.00000
title: Mulliken charges with hydrogens summed into heavy atoms:
elementType: O O C C C C C C C C C C
charge: -0.223439 -0.233940 0.227610 -0.054145 -0.059802 -0.015328 -0.012454 0.004578 -0.047797 0.041357 0.154894 0.218465
polarizability: 1.44973484e+02 1.01514075e+00 1.03296856e+02 -1.02116242e+00 -3.03300718e+00 8.75591876e+01
1716.lowfreq: -5.0162 -0.0008 -0.0007 -0.0005 10.3001 15.8775 28.8658 46.6622 62.8388
frequency: 24.8226 46.0713 62.3775 79.5483 110.0437 140.1720 175.0568 220.8362 248.0219 295.1136 316.8704 335.1938 397.9597 435.3578 448.8752 458.0960 546.4603 731.0825 745.7352 775.4755 784.2002 826.4428 840.2627 860.1492 887.2549 891.6181 914.4667 960.1858 960.9876 1015.0009 1041.1739 1052.7440 1056.0902 1071.1174 1093.2182 1101.7536 1105.1993 1118.1349 1149.2247 1174.1879 1190.3509 1237.3828 1253.9190 1256.9411 1263.4474 1275.2216 1284.6399 1300.3821 1314.8780 1331.4815 1334.7551 1339.6912 1340.1806 1341.8532 1353.2204 1362.8026 1370.8521 1457.1095 1461.1093 1463.4429 1465.2647 1468.1695 1470.0352 1476.3268 1485.4591 1621.4877 2930.7862 2948.9149 2951.0372 2958.0213 2963.7594 2964.1392 2965.2408 2992.2388 3001.2415 3003.2637 3015.0756 3023.6795 3025.6071 3027.5532 3034.7799 3039.6768 3048.9527 3078.9644
redmass: 7.5553 2.9763 3.6561 2.3797 2.5705 4.4512 2.6054 1.7873 4.0754 4.2135 1.7327 2.4603 2.4530 2.8553 2.0381 3.1639 1.8379 5.8870 1.2754 1.8900 1.5751 1.3534 2.5169 4.0152 1.6381 1.4935 1.9241 1.6258 2.3344 1.4804 2.9582 1.7205 1.2878 1.7865 2.1173 4.4570 2.2496 2.5805 1.7993 1.4645 1.5174 1.3308 1.2559 1.2299 1.2389 1.2105 1.1475 1.2374 1.2501 1.3425 1.3701 1.2405 1.4802 1.5836 1.4092 1.5175 1.4815 1.0858 1.0901 1.0896 1.0828 1.0827 1.0841 1.0954 1.0933 8.5526 1.0808 1.0598 1.0621 1.0626 1.0619 1.0600 1.0672 1.0620 1.0969 1.0592 1.0973 1.0987 1.0948 1.1013 1.0914 1.1036 1.1026 1.1077
irintensity: 1.6786 0.1042 0.3955 0.1856 0.1727 1.8702 1.7630 0.0874 0.0544 7.4248 0.2202 28.8047 3.2843 0.0818 1.1196 5.1512 0.4137 2.5847 5.5091 1.1185 0.4025 0.0690 5.2413 17.6831 1.4161 12.6762 0.7569 4.0490 3.0101 3.2966 4.5824 0.6995 2.3453 20.4961 47.5079 287.5469 24.6961 0.6976 1.2141 1.4596 0.7374 0.5622 3.8364 1.1290 3.1190 1.2488 1.5080 0.1496 1.0999 3.9491 0.3172 6.8878 1.7238 1.5398 0.5467 2.9344 13.6575 0.8336 4.6756 9.0792 3.2886 10.8246 10.0253 2.8705 18.2163 298.9937 6.2920 0.5530 34.3999 85.8346 28.3255 31.2257 30.9822 8.0195 8.6966 29.3391 94.6183 82.9521 37.1964 7.3742 61.7508 143.3788 7.5888 64.7414
temp: 298.150 k
press: 1.00000 atm
elementType: 8 8 6 6 6 6 6 6 6 6 6 6 1 1 1 1 1 1 1 1 1 1 1 1 1 1 1 1 1 1
symmnumber: 1
zpe: 693773.8 jmol-1
zpe.correction: 0.264244 hartree
zpe.thermalcorrener: 0.277239 hartree
zpe.thermalcorrenthalpy: 0.278184 hartree
zpe.thermalcorrgfe: 0.223059 hartree
zpe.sumelectzpe: -541.335090 hartree
zpe.sumelectthermal: -541.322095 hartree
zpe.sumelectthermalent: -541.321151 hartree
zpe.sumelectthermalfe: -541.376276 hartree
dipole: 2.5214 0.8016 -0.4528
dipole: 2.6842
quadrupole: -89.1415 -75.8071 -73.4004
quadrupole: -7.8196 3.7614 1.1260
quadrupole: -9.6919 3.6426 6.0493 -7.8196 3.7614 1.1260
hfenergy: -541.5993344 hartree
pointgroup: C01 [X(C10H18O2)]
dipole: 0.98977 0.3267824 -0.1697905 debye
polarizability: 144.9541188|1.6069279|103.2623928|-0.3025511|-3.201667|87.6130169 unknown
InChI: InChI=1S/C10H18O2/c11-9-12-8-4-7-10-5-2-1-3-6-10/h9-10H,1-8H2
charge 0 multiplicity 1
30 atoms
O  -3.535816 0.681003 -0.387995
O  -5.278515 -0.740364 0.271529
C  1.40616 -0.258463 -0.243247
C  1.839657 1.088764 0.394255
C  2.452159 -1.358318 0.079465
C  3.269317 1.500946 -0.0323
C  3.881333 -0.952894 -0.351529
C  4.299924 0.392614 0.28723
C  -0.010675 -0.702126 0.202148
C  -1.141815 0.252507 -0.250797
C  -2.519162 -0.321477 0.075228
C  -4.863877 0.327176 -0.223748
H  1.389847 -0.121326 -1.3483
H  1.802261 0.985663 1.50033
H  1.127183 1.89197 0.123591
H  2.161435 -2.307326 -0.41444
H  2.442575 -1.551977 1.173565
H  3.278825 1.702205 -1.123909
H  3.554869 2.446506 0.468729
H  4.601054 -1.74869 -0.077179
H  3.916166 -0.856639 -1.456827
H  -0.206667 -1.715784 -0.207275
H  -0.027005 -0.802869 1.308044
H  5.305953 0.69031 -0.067324
H  4.371083 0.267314 1.38787
H  -1.038788 1.237567 0.240334
H  -1.070308 0.425533 -1.342257
H  -2.713325 -1.277209 -0.445959
H  -2.663887 -0.483265 1.159545
H  -5.496357 1.150749 -0.606578
