program: Gaussian 09
title: 000070788
version: EM64L-G09RevD.01
frameworkgroup: C1[X(C6H2Cl5N)]
method: RPBEPBE
basis: SDD
operation: Freq
keyword: #p
keyword: freq=noraman
keyword: PBEPBE/SDD
title: #p freq=noraman PBEPBE/SDD
converged: NO YES NO NO
title: Mulliken charges:
elementType: Cl Cl Cl Cl Cl N C C C C C C H H
charge: 0.096778 0.161009 0.096784 -0.001324 0.007389 0.095666 0.359805 -0.760496 -0.222701 -0.018917 -0.105664 -0.295824 0.299521 0.287975
chargesum: 0.00000
title: Mulliken charges with hydrogens summed into heavy atoms:
elementType: Cl Cl Cl Cl Cl N C C C C C C
charge: 0.096778 0.161009 0.096784 -0.001324 0.007389 0.095666 0.359805 -0.760496 0.076819 -0.018917 0.182311 -0.295824
polarizability: 1.39781112e+02 1.35241319e+00 1.49486328e+02 3.13083654e-03 -1.34037943e-03 7.15985977e+01
1716.lowfreq: -8.8290 -4.7339 0.0015 0.0026 0.0044 6.6941 6.9724 78.2869 107.1652
frequency: -6.8445 78.2810 107.1647 145.9291 155.9616 190.9758 193.1170 219.9916 243.2538 279.2449 292.8155 361.3832 391.7597 406.8074 447.7829 536.2415 563.5107 658.6535 679.8231 735.3382 752.6450 786.0859 868.7195 883.0854 927.0631 940.3863 1088.5128 1154.0806 1215.7605 1328.6823 1356.3918 1381.1656 1528.3313 1555.8770 3192.6661 3198.3290
redmass: 28.2115 16.8568 25.2230 6.4241 34.0502 28.2802 6.8368 13.7598 17.2477 26.7358 12.8918 29.5119 13.9959 9.3720 8.3005 6.1076 7.2973 11.0880 6.1717 11.4586 4.1616 11.8993 1.4964 1.4841 8.1517 8.0110 1.5526 1.9668 4.2603 5.7180 3.9281 3.6923 6.2640 9.6690 1.0942 1.0953
irintensity: 0.2129 0.1161 0.5096 0.2045 0.0499 0.7816 2.2640 1.5721 1.7461 0.2749 0.0039 1.7058 8.1355 5.3398 14.0709 18.6047 50.4162 87.8076 52.4017 209.2463 83.4804 0.1322 20.9558 1.1012 12.4375 1.3180 21.6746 50.5325 84.3291 49.3461 70.0597 3.4618 179.0890 131.0578 2.9637 2.4178
temp: 298.150 k
press: 1.00000 atm
elementType: 17 17 17 17 17 7 6 6 6 6 6 6 1 1
symmnumber: 1
zpe: 172536.3 jmol-1
zpe.correction: 0.065716 hartree
zpe.thermalcorrener: 0.076830 hartree
zpe.thermalcorrenthalpy: 0.077774 hartree
zpe.thermalcorrgfe: 0.027058 hartree
zpe.sumelectzpe: -2583.999274 hartree
zpe.sumelectthermal: -2583.988160 hartree
zpe.sumelectthermalent: -2583.987215 hartree
zpe.sumelectthermalfe: -2584.037931 hartree
dipole: 1.9530 -1.8497 -0.0013
dipole: 2.6899
quadrupole: -101.6254 -106.1200 -103.7488
quadrupole: -0.2326 0.0030 -0.0010
quadrupole: 2.2060 -2.2886 0.0826 -0.2326 0.0030 -0.0010
hfenergy: -2584.0649894 hartree
pointgroup: C01 [X(C6H2Cl5N1)]
dipole: -0.7808456 0.7143287 0.0002311 debye
dipolederiv: -0.3512205 -0.0799389 -0.160227 -0.1246245 -0.2948845 -0.2853908 -0.1680457 -0.2411044 -0.5920591 -0.2153803 0.2460564 0.0008397 0.2256511 -0.5680892 -0.0017265 0.0005094 -0.0016286 -0.1121607 -0.3500651 -0.0807215 0.1595854 -0.1252678 -0.2981005 0.2871646 0.166485 0.2426868 -0.5888639 -0.3293984 0.313387 0.0003118 0.3330021 -0.5760703 -0.000435 0.0003455 -0.0004303 -0.0326313 -0.2968182 -0.3192489 0.0000006 -0.3994767 -0.7496896 -0.0000864 -0.0000127 -0.0001435 -0.054095 -0.7909999 -0.5066288 0.0002001 -0.0660235 -0.5127112 -0.0001934 0.0004719 0.0003646 -0.1511164 0.3968287 0.1769538 -0.0000583 -0.0514387 0.1901316 0.0001375 0.0011066 -0.0000166 -0.106667 1.0108896 -0.1137528 -0.0003458 -0.0635159 1.2107598 -0.0000757 -0.0003409 -0.0000351 1.3770097 -0.551903 0.1775912 0.0003321 0.2339249 -0.2712105 -0.0000325 0.0004096 -0.0003765 -0.0329238 0.7696227 -0.4258221 -0.0005817 -0.4626449 1.0509114 0.0007312 -0.0007895 0.000783 -0.0280005 -0.1785796 0.0679801 0.0000891 -0.1531544 -0.7467877 -0.0002927 0.0000184 -0.0003806 -0.0284044 0.7246631 0.5818904 -0.0002171 0.7077551 1.3835215 0.0002659 -0.0002504 0.000199 0.0327348 0.1223682 -0.0315773 -0.0000054 -0.0592188 0.066788 -0.0000361 0.0000291 0.000087 0.1489354 0.0399927 -0.0061687 0.0000765 0.0050319 0.1154311 -0.0000301 0.0000636 -0.0000049 0.1682422 unknown
polarizability: 139.7371691|1.1835861|149.5302324|-0.038478|0.0359357|71.5986365 unknown
InChI: InChI=1S/C6H2Cl5N/c7-3-1-4(6(9,10)11)12-5(8)2-3/h1-2H
charge 0 multiplicity 1
14 atoms
Cl 2.615926 0.991593 1.517556
Cl 2.798174 -1.61118 -0.006522
Cl 2.615238 1.001062 -1.51404
Cl -2.62443 2.647635 0.002644
Cl -2.221744 -2.889123 -0.000085
N  -0.104642 -1.204961 -0.000678
C  0.497085 0.01065 -0.000616
C  2.026139 0.053128 -0.001096
C  -0.228421 1.228313 0.00048
C  -1.632864 1.1362 0.001349
C  -2.285306 -0.113569 0.001166
C  -1.443901 -1.246899 0.000177
H  0.28278 2.192628 0.000542
H  -3.372935 -0.202676 0.001723
