program: Gaussian 09
title: 000070785
version: EM64L-G09RevD.01
frameworkgroup: C1[X(C9H9ClO2)]
method: RPBEPBE
basis: SDD
operation: Freq
keyword: #p
keyword: freq=noraman
keyword: PBEPBE/SDD
title: #p freq=noraman PBEPBE/SDD
converged: NO YES NO NO
title: Mulliken charges:
elementType: Cl O O C C C C C C C C C H H H H H H H H H
charge: -0.054181 -0.286868 -0.252756 0.235713 -0.320820 -0.343636 -0.222660 0.200530 -0.078961 -0.196045 -0.216154 -0.673412 0.232103 0.232082 0.295719 0.275277 0.237767 0.260816 0.214883 0.230300 0.230303
chargesum: 0.00000
title: Mulliken charges with hydrogens summed into heavy atoms:
elementType: Cl O O C C C C C C C C C
charge: -0.054181 -0.286868 -0.252756 0.235713 -0.025102 -0.068360 0.241525 0.200530 -0.078961 0.041722 0.044662 0.002074
polarizability: 1.69984316e+02 2.06081668e+00 1.17735174e+02 -2.83901349e-02 1.16637216e-03 5.32550022e+01
1716.lowfreq: -28.4326 -7.6348 -2.3360 -0.0034 -0.0021 0.0005 14.4542 60.0853 89.6833
frequency: -19.2853 59.8785 89.6830 99.4726 173.0394 182.0896 196.5266 252.7389 281.6533 328.9433 366.1635 391.3621 427.5434 496.3942 496.5692 644.9350 670.9979 703.0365 723.5900 795.2758 802.7164 806.5429 862.7004 923.7424 936.1219 985.0073 992.8242 1022.0477 1070.0555 1081.4482 1088.5718 1112.7368 1135.9842 1175.5975 1231.9166 1247.6822 1282.7894 1357.5747 1385.1899 1398.8016 1417.2474 1458.7239 1463.8304 1472.8280 1485.7676 1573.2323 1603.2065 1620.5427 2996.8966 3011.8359 3070.4272 3093.7098 3108.8459 3147.9410 3172.9391 3173.8795 3186.4830
redmass: 2.7437 4.6170 4.6337 3.2678 3.8881 7.3654 3.3304 1.3603 5.5494 4.8414 4.7620 9.8040 3.1553 5.3540 5.6434 7.2186 3.4375 8.5833 2.9236 1.1055 4.5627 1.5355 5.0644 1.3608 1.4526 6.2185 1.3529 2.3411 2.7610 3.5283 1.5503 2.2247 1.4715 1.0843 3.0946 1.1316 1.3422 1.4001 10.3964 1.2690 2.9029 2.4269 1.0405 1.0600 1.0713 7.1313 6.9351 10.8779 1.0357 1.0581 1.1066 1.0985 1.1028 1.0880 1.0941 1.0930 1.0973
irintensity: 0.0076 1.6999 0.5816 1.6049 0.9993 1.6267 0.7530 1.2060 9.6516 2.4009 8.1910 4.4238 1.2039 7.2832 3.9621 3.0438 4.3189 43.4430 58.5239 0.3753 14.2081 32.5409 63.0983 3.6080 11.7997 0.8193 0.6238 51.8448 22.9131 179.6469 3.3291 3.5583 5.8357 15.4800 459.6098 0.0145 22.7213 3.7898 0.9884 21.3403 61.1747 5.9778 12.5581 5.5107 12.4867 63.1268 7.5925 148.6504 20.5509 18.4973 7.1486 29.5484 44.4554 7.2210 1.1052 4.0512 5.6697
temp: 298.150 k
press: 1.00000 atm
elementType: 17 8 8 6 6 6 6 6 6 6 6 6 1 1 1 1 1 1 1 1 1
symmnumber: 1
zpe: 414735.0 jmol-1
zpe.correction: 0.157964 hartree
zpe.thermalcorrener: 0.168800 hartree
zpe.thermalcorrenthalpy: 0.169744 hartree
zpe.thermalcorrgfe: 0.120474 hartree
zpe.sumelectzpe: -957.995124 hartree
zpe.sumelectthermal: -957.984289 hartree
zpe.sumelectthermalent: -957.983345 hartree
zpe.sumelectthermalfe: -958.032615 hartree
dipole: 2.3675 3.0456 -0.0001
dipole: 3.8576
quadrupole: -66.9930 -76.1580 -78.6096
quadrupole: -3.0954 0.0001 0.0007
quadrupole: 6.9272 -2.2378 -4.6894 -3.0954 0.0001 0.0007
hfenergy: -958.1530885 hartree
pointgroup: C01 [X(C9H9Cl1O2)]
dipole: -0.8312644 1.2697823 0.0000482 debye
dipolederiv: -0.6508171 0.3044556 0.0002165 0.3632691 -0.3306078 -0.0001371 0.0002452 -0.0001429 -0.070216 -1.8161232 0.2544402 -0.0000998 0.4664444 -0.5766892 -0.0000399 -0.0006757 0.0001979 -0.2773832 -0.7681774 -0.1774661 0.0001112 -0.0001099 -0.9388602 0.0004208 0.0000861 -0.0002812 -0.3207595 -0.4886604 -0.1700318 0.0000505 -0.242072 -0.0394753 0.0000673 0.0002885 0.0000696 -0.0034598 -0.2269738 0.2271582 0.0000418 -0.0057275 -0.0917532 -0.0000295 0.0002206 -0.0000513 -0.0753689 0.0084282 -0.0713971 -0.0000755 0.1043168 -0.0610536 -0.0000489 0.0000771 0.0000843 -0.1232556 1.0630234 -0.0569597 0.0001168 0.0726425 0.2381192 0.0000204 0.0002424 -0.0000444 0.3551225 2.0930141 0.1032652 -0.0001724 -0.286625 1.2340813 -0.0004278 -0.0002064 -0.0000563 0.2306141 0.9393062 -0.5833667 -0.0004026 -0.6608537 0.3673994 0.0002481 -0.0004823 0.00026 -0.0599949 -0.0852929 0.0131679 -0.0000319 0.066568 0.1552035 -0.0000371 -0.0000484 -0.0000419 -0.1427651 -0.1475149 0.1326127 -0.0000037 0.1563578 -0.1070618 -0.0000663 0.0000332 -0.000059 -0.0987916 -0.106764 0.0883332 -0.0000451 0.0630306 -0.0187032 0.0000711 -0.000073 0.0000662 0.0618155 -0.0683375 0.0281516 0.0167002 -0.0558541 0.0022878 -0.0913169 -0.0247843 -0.0967831 -0.0566334 -0.068369 0.0280473 -0.0166583 -0.0559411 0.0023509 0.0912949 0.0248291 0.0968138 -0.0567443 0.1568157 -0.0164026 0.0000161 0.015157 0.040955 0.0000031 0.0000136 0.0000085 0.1645114 0.0502977 0.0751323 0.0000655 0.0846072 0.0704739 -0.0000191 0.0000724 -0.0000189 0.158484 0.0620483 -0.010519 0.0000338 -0.027878 -0.1025709 0.000014 0.0000157 0.0000188 0.1582716 -0.0225848 -0.0563927 0.0000818 -0.0456441 0.0874497 0.0000228 0.0000988 0.0000315 0.1649067 -0.1644847 -0.0535903 -0.0000796 -0.0740997 0.0558189 -0.000023 -0.0001035 -0.0000114 0.1173007 0.1206054 -0.0292821 -0.0444506 0.0312479 0.0062701 -0.099677 -0.0175829 -0.1110581 -0.0628077 0.1205608 -0.0293561 0.0445853 0.0311638 0.0063655 0.0996602 0.0177337 0.110998 -0.0628465 unknown
polarizability: 169.3082732|-6.2540045|118.411217|-0.0283913|0.0011382|53.2550022 unknown
InChI: InChI=1S/C9H9ClO2/c1-2-12-9(11)7-4-3-5-8(10)6-7/h3-6H,2H2,1H3
charge 0 multiplicity 1
21 atoms
Cl 4.089927 -1.306507 -0.001113
O  -2.196227 0.22758 0.000712
O  -1.326469 -1.935613 0.000584
C  0.187788 -0.01958 0.000614
C  1.337279 -0.851975 0.000103
C  0.324463 1.391999 0.000477
C  -3.573619 -0.355153 0.000248
C  -1.146805 -0.692539 0.001279
C  2.603684 -0.247689 -0.000484
C  1.61188 1.969071 -0.000115
C  2.767177 1.152526 -0.000605
C  -4.547206 0.818254 -0.000419
H  -3.677095 -0.995678 -0.89413
H  -3.677841 -0.995279 0.894824
H  1.212109 -1.938479 0.000203
H  -0.573287 2.015036 0.000863
H  1.726329 3.057867 -0.000204
H  3.768448 1.592701 -0.001065
H  -5.585628 0.440189 -0.00077
H  -4.408079 1.447531 0.895037
H  -4.407329 1.447138 -0.896036
