program: Gaussian 09
title: 000070777
version: EM64L-G09RevD.01
frameworkgroup: C1[X(C8H9NOS)]
method: RPBEPBE
basis: SDD
operation: Freq
keyword: #p
keyword: freq=noraman
keyword: PBEPBE/SDD
title: #p freq=noraman PBEPBE/SDD
converged: NO NO NO NO
title: Mulliken charges:
elementType: S O N C C C C C C C C H H H H H H H H H
charge: -0.010603 -0.259070 -0.440659 0.490734 -0.336404 -0.436993 -0.168004 -0.194939 -0.220223 0.211228 -0.798439 0.310631 0.220267 0.308340 0.225091 0.241340 0.237869 0.269283 0.235140 0.115410
chargesum: 0.00000
title: Mulliken charges with hydrogens summed into heavy atoms:
elementType: S O N C C C C C C C C
charge: 0.104806 -0.259070 -0.132319 0.490734 -0.025773 -0.216725 0.057087 0.046401 -0.220223 0.211228 -0.056147
polarizability: 1.94533500e+02 -2.96299513e+00 1.11884781e+02 -2.60518800e-02 -7.21937536e-02 4.85705101e+01
1716.lowfreq: -54.8186 -4.2208 -0.0028 -0.0004 0.0013 5.1145 22.2372 62.7746 71.6959
frequency: -53.8928 62.7732 71.6823 123.4046 132.8545 157.5122 246.0555 282.2334 334.9696 355.4113 406.0616 425.0919 507.2874 561.7580 581.9921 629.1036 636.3741 684.4505 711.9115 819.7546 820.6584 838.4757 876.0716 929.7376 939.9146 977.1361 985.0676 997.3974 1030.7465 1085.8490 1125.6458 1193.6288 1218.8241 1262.5616 1302.6399 1358.6037 1375.0363 1407.6972 1447.6827 1468.6869 1481.8522 1500.1923 1586.8062 1614.6241 1631.8876 2440.0823 2983.6224 3069.3967 3109.5018 3126.6836 3131.2894 3149.3226 3193.0443 3520.6383
redmass: 1.0889 4.8503 4.6226 1.1897 5.6601 3.2360 6.9756 4.8460 4.9091 4.6783 2.9571 5.3597 2.5996 4.7710 3.0582 6.9851 1.1757 6.1426 3.6086 1.4217 4.6456 1.4043 1.1363 5.7450 1.3662 1.3209 1.7412 3.2823 1.6519 2.8417 1.3616 1.1299 3.2019 1.9124 1.3721 4.7465 1.2450 4.0773 1.1364 1.0473 2.1729 2.2185 5.2755 6.2703 5.0501 1.0382 1.0381 1.0985 1.0892 1.0909 1.0980 1.0953 1.0944 1.0764
irintensity: 0.0086 0.1782 9.0389 30.0224 7.6134 3.5409 0.4245 0.9558 0.3237 1.6856 0.0401 16.1659 41.7852 1.0152 0.2330 0.0321 65.6373 12.7892 0.4545 42.6523 3.7819 50.8210 12.0354 8.4919 2.1190 5.0955 15.4753 24.6599 7.9801 33.8732 23.2474 0.0405 41.2901 35.0813 27.0817 147.9655 57.3813 29.8000 49.2565 19.8598 68.3975 400.4256 46.4628 2.8146 147.8047 15.2411 9.7058 15.8852 19.1997 10.3803 7.2885 8.2135 6.6583 12.0204
temp: 298.150 k
press: 1.00000 atm
elementType: 16 8 7 6 6 6 6 6 6 6 6 1 1 1 1 1 1 1 1 1
symmnumber: 1
zpe: 394239.4 jmol-1
zpe.correction: 0.150158 hartree
zpe.thermalcorrener: 0.160603 hartree
zpe.thermalcorrenthalpy: 0.161547 hartree
zpe.thermalcorrgfe: 0.113364 hartree
zpe.sumelectzpe: -837.494643 hartree
zpe.sumelectthermal: -837.484198 hartree
zpe.sumelectthermalent: -837.483253 hartree
zpe.sumelectthermalfe: -837.531437 hartree
dipole: -1.3581 2.9325 0.0239
dipole: 3.2318
quadrupole: -68.5381 -66.0167 -76.9305
quadrupole: -16.4287 0.0233 -0.0421
quadrupole: 1.9570 4.4784 -6.4354 -16.4287 0.0233 -0.0421
hfenergy: -837.6448008 hartree
pointgroup: C01 [X(C8H9N1O1S1)]
dipole: -0.479624 -1.1775182 -0.0080392 debye
dipolederiv: -0.6567644 -0.1869003 0.0017883 -0.2548166 0.125636 -0.0043643 -0.0010649 -0.0048069 -0.1640631 -0.6914055 -0.0552989 -0.0000181 0.6170298 -0.9251415 -0.0010029 -0.0026189 -0.0002392 -0.3430956 -1.8474421 0.1876874 0.0007374 0.4159208 -0.3751769 0.0003834 0.0003206 0.0001293 -0.3247366 1.1009182 0.0784344 -0.0017918 0.335943 -0.0365772 -0.0001238 -0.0026356 -0.0004268 0.0890357 -0.1393933 0.0381471 -0.0001743 -0.1186122 -0.0139092 -0.0003337 -0.0007872 -0.0001862 -0.1511591 -0.1195072 -0.0487656 0.0001358 0.1062618 0.0823376 -0.0004213 0.0002063 -0.0000337 -0.2064564 -0.3397364 -0.0597404 0.0004054 0.0975915 0.1100645 0.0000816 -0.0012279 -0.0007794 -0.1339659 -0.2361513 -0.0319913 -0.0005514 -0.2534873 0.0680447 0.0004968 0.0017356 0.0001823 -0.1083046 1.0558301 0.2044955 -0.0011173 0.3638765 -0.0949002 0.0007785 -0.0020226 0.0009379 -0.098683 1.8034342 -0.1248466 0.0019254 -0.9784542 1.1844135 0.0020727 0.0111099 0.0021784 0.1652954 -0.405989 -0.1390305 -0.0004797 -0.2698334 -0.1133829 -0.0041118 -0.0127982 -0.0065 0.0606654 0.1445418 0.0553767 0.0001216 0.0202916 0.0740238 0.0001228 0.000426 0.0001529 0.1842326 0.0223917 -0.1072043 0.0004106 -0.0919928 -0.0849505 0.000319 0.0002681 0.0003654 0.1679513 0.1600656 0.0211736 0.000171 -0.0350538 0.0898915 0.0003212 0.0005635 0.0007786 0.3049645 0.0266284 -0.0846618 0.0002892 -0.0754702 -0.0585618 0.0001018 0.0002713 0.0004421 0.1520018 0.0093959 0.0971699 0.0002614 0.0848433 0.0059839 -0.0004149 0.0003324 -0.0001897 0.1610206 0.0475867 -0.0038346 0.0261719 -0.042822 0.037844 -0.103525 -0.0288444 -0.107968 -0.0382086 -0.0070477 0.0501371 0.0036623 0.1214338 0.0234018 -0.0045232 0.0080371 -0.0024353 0.1310493 0.0494323 0.0016221 -0.0304326 -0.0416948 0.0233454 0.11056 0.0263495 0.1144559 -0.0271195 0.0232119 0.1080305 -0.0015151 -0.0009548 -0.1223864 0.003583 0.0023792 0.0039422 0.1795757 unknown
polarizability: 194.0740935|6.8213225|112.3439609|-0.1056432|-0.1277728|48.5707363 unknown
InChI: InChI=1S/C8H9NOS/c1-6(10)9-7-2-4-8(11)5-3-7/h2-5,9,11H,1H3
charge 0 multiplicity 1
20 atoms
S  4.359502 0.400831 -0.004356
O  -2.664225 1.427077 0.003257
N  -1.645937 -0.691198 0.004298
C  -0.260857 -0.357416 0.001936
C  0.221587 0.978871 -0.000474
C  0.672917 -1.428915 0.001678
C  1.61078 1.220328 -0.002449
C  2.057608 -1.179471 -0.001318
C  2.538772 0.152897 -0.003376
C  -2.7533 0.164539 0.003529
C  -4.094668 -0.572704 -0.000316
H  -0.491793 1.804825 -0.000304
H  0.319182 -2.468648 0.003109
H  -1.853554 -1.693124 0.005773
H  1.961338 2.259686 -0.003332
H  2.757174 -2.022417 -0.002796
H  -4.212291 -1.184819 -0.914285
H  -4.901875 0.173663 0.030342
H  -4.19201 -1.238926 0.877368
H  4.328952 1.78562 -0.021182
