program: Gaussian 09
title: 000070801
version: EM64L-G09RevD.01
frameworkgroup: C1[X(C10H11N3)]
method: RPBEPBE
basis: SDD
operation: Freq
keyword: #pfreq=noraman
keyword: PBEPBE/SDD
title: #p freq=noraman PBEPBE/SDD
converged: YES YES NO NO
title: Mulliken charges:
elementType: N N N C C C C C C C C C C H H H H H H H H H H H
charge: -0.292192 -0.122103 -0.653931 0.432058 0.345050 0.237533 -0.545143 -0.412911 -0.385320 -0.766175 -0.214435 -0.204333 -0.252444 0.252183 0.271739 0.280545 0.225887 0.228523 0.243708 0.226652 0.228437 0.317935 0.328999 0.229738
chargesum: 0.00000
title: Mulliken charges with hydrogens summed into heavy atoms:
elementType: N N N C C C C C C C C C C
charge: -0.292192 -0.122103 -0.006997 0.432058 0.345050 0.237533 -0.292960 -0.141173 -0.104775 -0.068058 0.012217 0.024105 -0.022706
polarizability: 1.94478752e+02 1.29228227e+00 1.30167302e+02 -1.25245120e+00 7.40429310e+00 6.48239463e+01
1716.lowfreq: -4.3006 -0.0008 -0.0006 -0.0005 1.5484 7.4848 58.0989 81.0893 107.2006
frequency: 58.0975 81.0796 107.2000 126.4929 190.7030 241.1424 259.8866 287.1303 311.4444 356.9617 389.6858 407.7520 432.7980 488.2216 542.1961 593.1315 612.2763 632.9565 659.3475 673.1292 702.8370 761.1801 770.6076 777.4501 851.7059 921.8365 975.0391 975.5954 980.4373 987.8842 992.4577 1014.2457 1029.5194 1044.8439 1046.2503 1063.5983 1103.2282 1170.9284 1172.5939 1185.3645 1294.2789 1319.3349 1378.0562 1384.0373 1396.9819 1442.8898 1453.0260 1468.1071 1469.8568 1486.1355 1511.9664 1577.5564 1597.1483 1613.5041 1635.0705 2982.8487 3060.4162 3101.8916 3127.9053 3138.0820 3153.0158 3165.1636 3183.2688 3222.4519 3543.3201 3685.0074
redmass: 3.8230 3.4970 1.1368 3.7683 3.4027 3.6942 2.5591 1.3083 3.9345 4.8159 3.2809 2.4019 1.5006 3.3381 3.1868 4.6630 6.4560 6.6857 2.9595 6.3086 2.2109 1.7079 1.6016 3.6469 1.2431 1.3942 1.6410 1.5668 3.7342 3.4951 1.4044 3.3728 1.9248 1.8844 1.6062 2.2304 2.1489 1.1029 1.4748 1.1367 3.7516 1.3639 3.7120 6.3071 1.3809 2.3115 1.9013 1.0883 3.9033 1.8029 3.2457 4.0725 4.7448 6.1157 1.3878 1.0372 1.0980 1.0982 1.0850 1.0893 1.0938 1.0989 1.0964 1.0987 1.0459 1.1023
irintensity: 2.9085 4.7636 0.0893 0.2925 3.7466 2.0236 3.6091 20.5732 3.8480 9.3968 22.0251 57.0721 209.2570 7.4080 3.3551 4.9060 0.7508 3.4267 7.8437 16.9302 26.7518 35.4426 79.5094 27.3529 1.6425 7.4591 8.3418 0.8938 6.1754 2.3833 0.8798 17.8972 0.3778 3.0814 4.6574 11.1219 9.4784 1.1971 8.4603 0.4018 3.2936 2.3963 27.7727 10.2996 29.3024 24.0187 62.9212 15.0191 12.0760 86.5980 165.6404 59.9780 50.7483 84.9721 218.8821 43.6930 23.6555 12.6635 1.8820 13.5247 21.0994 22.3939 2.8379 4.8311 35.3153 40.2316
temp: 298.150 k
press: 1.00000 atm
elementType: 7 7 7 6 6 6 6 6 6 6 6 6 6 1 1 1 1 1 1 1 1 1 1 1
symmnumber: 1
zpe: 504648.0 jmol-1
zpe.correction: 0.192210 hartree
zpe.thermalcorrener: 0.203839 hartree
zpe.thermalcorrenthalpy: 0.204783 hartree
zpe.thermalcorrgfe: 0.154645 hartree
zpe.sumelectzpe: -550.976002 hartree
zpe.sumelectthermal: -550.964373 hartree
zpe.sumelectthermalent: -550.963428 hartree
zpe.sumelectthermalfe: -551.013567 hartree
dipole: -0.4775 3.0852 -1.2807
dipole: 3.3744
quadrupole: -64.8592 -65.7638 -80.2990
quadrupole: 2.5901 -0.8926 -0.3673
quadrupole: 5.4481 4.5435 -9.9917 2.5901 -0.8926 -0.3673
hfenergy: -551.1682118 hartree
pointgroup: C01 [X(C10H11N3)]
dipole: -0.1708124 1.2309041 -0.4671387 debye
dipolederiv: -1.3839909 -0.2224293 0.0241393 -0.0298497 -0.2768428 -0.0170552 0.0180034 0.0086814 -0.0428261 -0.0540019 -0.1824425 0.0356932 -0.5159698 -0.4307245 0.0398852 -0.1273623 0.0115641 -0.2203089 -0.3939068 0.4079193 0.0207673 0.2060994 -1.1875823 0.0622817 0.0939295 -0.0617091 -0.5865904 1.4264463 0.2049885 -0.0284081 0.2262724 0.0537224 0.0553676 0.0343523 0.0310393 0.0804333 0.9803987 -0.3521478 0.0404945 0.2420323 1.1231717 -0.1768033 0.0606063 -0.1825372 0.1469643 0.156983 -0.0540797 0.0037391 -0.3490763 0.5805815 -0.0902302 0.0794114 -0.0762398 0.009967 -0.6123971 0.3599292 -0.0655019 0.3366941 -0.3919097 0.0272646 -0.0673579 0.0502748 -0.370664 -0.3250291 -0.0399269 0.0194751 0.1464324 -0.0879411 0.0663598 0.0483954 0.0955338 -0.1349544 -0.2708338 -0.0770869 -0.0071459 -0.3238785 -0.0801263 0.0518862 -0.0151941 0.024709 -0.131273 -0.0916769 0.0768536 -0.0151176 0.0429418 -0.0174419 0.0145113 0.0132179 0.0175385 0.0869712 0.1028775 -0.0042413 -0.020487 -0.0640921 0.0625049 0.105807 -0.0692141 0.0987499 -0.1002156 0.1153631 0.0441488 0.0064807 0.0671834 0.1142205 0.1104201 0.0258184 0.1076244 -0.0977311 -0.0423245 0.0025734 0.0028704 0.0340148 -0.1398599 0.016024 0.0085892 0.0080288 -0.1757463 -0.0055571 -0.0880724 0.015443 -0.0957666 0.0276182 0.0279784 -0.0028305 0.0240559 0.2266289 0.0884062 -0.0624925 -0.0370785 -0.0481405 0.0139344 -0.0765984 -0.0487015 -0.0776513 0.11832 0.0887994 0.0690129 0.0380714 0.0603157 0.0653369 -0.0556014 0.0516027 -0.0364394 0.1405653 -0.0572483 0.0414169 0.0978479 0.0375089 0.0815683 0.0416754 0.1508041 -0.0090864 -0.0493309 -0.0314629 0.0230922 -0.1027835 0.0025043 0.0706737 -0.0671292 -0.1547561 -0.0164738 -0.0488991 0.0880135 -0.105469 0.0093653 0.0068185 -0.0937445 0.0233353 -0.0021492 0.0164363 0.1140123 -0.0070622 0.0766667 0.0477237 0.1003458 -0.0089691 -0.0858986 0.0657414 -0.0772013 0.1128465 0.0382839 -0.0676027 -0.0258511 -0.0849611 -0.0536063 -0.089643 -0.045231 -0.0873074 0.115824 0.1232277 -0.0211473 -0.0104737 0.0022199 0.2444407 0.0428475 0.008554 0.107344 0.346697 0.2048138 0.0002743 -0.0491658 0.0285934 0.2323616 0.0048782 -0.1258423 0.0481648 0.3028281 -0.1381218 -0.0297375 -0.0000978 -0.0282423 0.0986134 -0.0315629 -0.000387 -0.0250993 0.156482 unknown
polarizability: 194.5094241|0.554344|129.6205198|-0.0706126|9.445555|65.3400561 unknown
InChI: InChI=1S/C10H11N3/c1-8-7-10(11)13(12-8)9-5-3-2-4-6-9/h2-7H,11H2,1H3
charge 0 multiplicity 1
24 atoms
N  0.572551 0.099796 0.027574
N  1.389038 -1.058457 0.158282
N  0.805775 2.520153 -0.331937
C  -0.84552 -0.053746 0.018635
C  1.347217 1.252531 -0.13172
C  2.661418 -0.575491 0.117153
C  2.691987 0.847063 -0.063991
C  -1.696827 0.953898 0.54426
C  -1.400856 -1.255349 -0.491113
C  3.824455 -1.519391 0.255027
C  -3.097445 0.771612 0.514234
C  -2.799451 -1.427994 -0.503173
C  -3.657299 -0.413664 -0.013242
H  3.570817 1.482935 -0.148371
H  -1.27067 1.841332 1.023151
H  -0.722397 -2.031703 -0.853396
H  4.490427 -1.469138 -0.626263
H  4.434074 -1.277685 1.145357
H  3.457047 -2.55381 0.356682
H  -3.748823 1.55052 0.926461
H  -3.222416 -2.358222 -0.898644
H  1.453023 3.281277 -0.517215
H  -0.146536 2.620599 -0.677296
H  -4.743587 -0.552166 -0.030153
