program: Gaussian 09
title: 000070779
version: EM64L-G09RevD.01
frameworkgroup: C1[X(C8H14N2O2)]
method: RPBEPBE
basis: SDD
operation: Freq
keyword: #p
keyword: freq=noraman
keyword: PBEPBE/SDD
title: #p freq=noraman PBEPBE/SDD
converged: NO YES NO NO
title: Mulliken charges:
elementType: O O N N C C C C C C C C H H H H H H H H H H H H H H
charge: -0.438182 -0.438182 -0.037689 -0.037691 0.128254 0.158331 0.003509 0.003513 -0.701117 -0.701146 -0.707305 -0.707300 0.229243 0.229243 0.220748 0.220750 0.229241 0.229242 0.212788 0.239740 0.239740 0.212786 0.239745 0.239743 0.365999 0.365999
chargesum: 0.00000
title: Mulliken charges with hydrogens summed into heavy atoms:
elementType: O O N N C C C C C C C C
charge: -0.072183 -0.072184 -0.037689 -0.037691 0.128254 0.158331 0.003509 0.003513 -0.021884 -0.021913 -0.015036 -0.015027
polarizability: 1.37097746e+02 4.23270093e-04 1.11316734e+02 -2.15487840e-05 7.45807956e-05 8.10905266e+01
1716.lowfreq: -0.0009 -0.0009 -0.0005 14.3707 17.5723 18.2832 51.0564 124.0769 124.8205
frequency: 51.0405 124.0625 124.7195 132.0548 157.6134 179.0425 195.8763 197.0292 199.8776 211.4831 243.9882 274.2671 283.1155 286.4209 317.6676 371.6636 375.9661 414.5668 414.5944 438.8382 564.6025 607.6895 632.7568 638.0140 695.6260 748.9830 835.4949 853.2442 859.8709 943.7711 950.5020 968.5500 991.9541 1006.6765 1013.4076 1051.7535 1114.5339 1169.5755 1177.2050 1186.0507 1235.2437 1247.2399 1287.7060 1315.1777 1366.3479 1371.3972 1387.6890 1391.3355 1454.9038 1460.3922 1461.0597 1468.1500 1471.2718 1477.5338 1482.9481 1489.2337 1636.3346 1701.2609 2986.8163 2988.4935 2991.9992 2992.9385 3088.8689 3090.8524 3091.6353 3093.0641 3095.2171 3095.7879 3103.6689 3106.8037 3562.2268 3562.5206
redmass: 4.0645 3.8584 3.1692 5.8741 3.2027 2.5983 1.0121 1.0345 4.4447 1.4709 1.0915 1.6065 2.5193 5.9280 3.3547 2.4511 3.9921 4.0830 1.1623 1.4636 3.6032 5.3401 2.9877 5.5773 5.7071 2.7745 4.4299 4.9019 8.8707 1.4269 1.4376 1.8055 1.2617 3.8834 1.3400 1.8673 4.1297 2.3655 2.0464 4.8471 2.0554 3.4271 1.3608 1.7248 1.1775 1.1802 1.1943 1.2009 1.0505 1.0501 1.0464 1.0450 1.0611 1.0662 1.0524 1.0544 8.7700 10.4141 1.0338 1.0342 1.0334 1.0340 1.1009 1.1013 1.1007 1.0999 1.0997 1.1005 1.1017 1.1009 1.0676 1.0676
irintensity: 0.2155 0.4902 0.0000 0.0163 0.0003 0.0000 0.0000 0.0000 3.6993 2.8842 0.0037 0.4975 0.1895 0.0000 6.1458 89.0564 0.4540 2.8782 0.0001 197.0705 1.1346 0.0000 27.9266 2.2953 0.5569 7.0184 18.5675 237.8580 45.5946 0.5629 1.5568 0.5452 0.0000 0.4402 0.0000 52.6119 0.2659 6.4612 4.3060 14.8201 25.4737 0.0316 71.7804 55.8311 4.3297 30.1920 13.9577 1.2621 0.6696 22.8875 0.0000 0.0000 16.7395 1.5678 7.2929 21.7816 1.0500 3.6219 21.7568 24.6440 31.6906 6.5316 0.8138 0.0003 35.8723 70.9975 0.8301 36.3763 0.0011 23.2346 65.9047 6.4730
temp: 298.150 k
press: 1.00000 atm
elementType: 8 8 7 7 6 6 6 6 6 6 6 6 1 1 1 1 1 1 1 1 1 1 1 1 1 1
symmnumber: 1
zpe: 553633.3 jmol-1
zpe.correction: 0.210868 hartree
zpe.thermalcorrener: 0.225315 hartree
zpe.thermalcorrenthalpy: 0.226259 hartree
zpe.thermalcorrgfe: 0.171307 hartree
zpe.sumelectzpe: -572.128469 hartree
zpe.sumelectthermal: -572.114022 hartree
zpe.sumelectthermalent: -572.113078 hartree
zpe.sumelectthermalfe: -572.168030 hartree
dipole: 0.0000 0.1382 -0.0006
dipole: 0.1382
quadrupole: -63.0737 -71.5738 -71.7006
quadrupole: 0.0000 -0.0001 0.0003
quadrupole: 5.7090 -2.7911 -2.9179 0.0000 -0.0001 0.0003
hfenergy: -572.3393366 hartree
pointgroup: C01 [X(C8H14N2O2)]
dipole: -0.0000291 0.0543846 0.0002283 debye
dipolederiv: -0.5698806 -0.3077869 -0.0000443 -0.9794148 -0.6421554 0.0001243 -0.0000719 0.0000631 -0.3814908 -0.570987 0.3078537 0.0000422 0.9794775 -0.6410573 0.000125 0.0000707 0.0000611 -0.3814913 0.1676627 0.2790748 -0.0000398 0.8600042 0.1614949 -0.0001004 -0.000067 -0.000071 -0.1582223 0.1686451 -0.2790733 0.0000404 -0.8600029 0.1605246 -0.0001006 0.0000632 -0.0000677 -0.1582228 0.2679096 0.0001214 -0.0000008 0.0001124 -0.0099805 0.0000941 -0.0000005 0.0000914 0.1808855 0.176033 0.0001464 -0.0000009 0.0001415 -0.168369 -0.000053 0.0000002 -0.0000074 0.2754448 0.0552345 -0.1094386 -0.0000077 -0.0514403 0.2740675 0.0000009 0.0000219 0.0000347 -0.1794274 0.0550992 0.1092531 0.0000097 0.051267 0.2742001 0.0000001 -0.0000227 0.0000348 -0.1794282 -0.0501581 -0.0000418 -0.0000146 -0.0000406 0.0348259 0.0411426 0.000012 -0.0249682 -0.0190069 -0.0501883 -0.0000387 0.0000146 -0.0000399 0.034761 -0.0411691 -0.0000089 0.0249068 -0.0189525 -0.0770754 -0.0000487 0.000013 -0.0000512 0.0364742 -0.0316219 -0.0000013 0.0071007 -0.0011924 -0.0770766 -0.0000541 -0.0000114 -0.0000526 0.0364436 0.031634 0.0000033 -0.0071106 -0.001204 -0.0458493 0.1321639 -0.0119109 0.1150124 -0.019318 0.0329837 0.0046372 0.0190563 0.0764452 -0.0456471 -0.1321837 0.0118799 -0.1150305 -0.0195175 0.0329896 -0.0046582 0.0190477 0.0764455 0.0970033 0.0000332 0.0000561 0.0000329 0.0195455 -0.1327386 0.0000366 -0.0859289 -0.0829779 0.097012 0.0000368 -0.0000623 0.0000379 0.0195856 0.1327177 -0.0000424 0.0858714 -0.0830498 -0.0456211 -0.1321844 -0.0118494 -0.1150199 -0.0194977 -0.0329622 0.0046881 -0.0190257 0.0764541 -0.0458363 0.1321605 0.0118867 0.1149971 -0.0192807 -0.032957 -0.0046625 -0.0190392 0.0764534 0.0980427 0.0000397 -0.0000614 0.0000407 0.0102937 0.1348954 -0.0000373 0.0802449 -0.0932389 -0.0242929 0.1240786 0.0157145 0.1054874 0.0105645 -0.0253374 0.0009732 -0.0052079 0.082499 -0.0240954 -0.1241103 -0.0156882 -0.1055178 0.010363 -0.0253489 -0.0009642 -0.005204 0.0825002 0.0980375 0.0000373 0.0000562 0.0000366 0.010335 -0.1348734 0.0000335 -0.0802116 -0.0932802 -0.0240842 -0.1241122 0.0156629 -0.1055081 0.010382 0.0253178 0.0009456 0.0051901 0.0825152 -0.0242743 0.1240874 -0.0156852 0.1054826 0.0105645 0.0253089 -0.0009511 0.0051926 0.0825141 0.1971022 0.099742 0.0000617 0.1122945 0.2124663 -0.0000357 0.0000981 -0.0000264 0.3695139 0.1972845 -0.0997564 -0.000061 -0.1123061 0.2122842 -0.000036 -0.0000956 -0.000027 0.3695144 unknown
polarizability: 137.0977416|0.0109654|111.3167384|-0.0000215|-0.0000746|81.0905266 unknown
InChI: InChI=1S/C8H14N2O2/c1-7(2)5(9-11)8(3,4)6(7)10-12/h11-12H,1-4H3
charge 0 multiplicity 1
26 atoms
O  -2.977733 -1.038051 -0.00021
O  2.978536 -1.035521 -0.000206
N  -2.340823 0.302785 -0.000279
N  2.340472 0.304768 -0.000271
C  -0.000608 1.328298 -0.000319
C  0.000358 -0.953039 -0.00056
C  -1.047657 0.18657 -0.00042
C  1.047403 0.187449 -0.000418
C  -0.000958 2.202273 -1.277754
C  -0.000964 2.202532 1.276866
C  0.000727 -1.829643 -1.278393
C  0.000707 -1.829917 1.277071
H  -0.900627 2.842641 -1.291689
H  0.898192 2.843368 -1.291664
H  -0.000696 1.583918 -2.192253
H  -0.000664 1.58438 2.191505
H  0.898156 2.843669 1.290643
H  -0.90065 2.842875 1.290698
H  0.00044 -1.21541 -2.195965
H  0.902961 -2.464961 -1.284489
H  -0.90095 -2.465751 -1.28446
H  0.000452 -1.215872 2.194771
H  -0.901006 -2.465968 1.282997
H  0.90293 -2.465247 1.283015
H  -3.941746 -0.804101 0.000091
H  3.942349 -0.800745 0.000091
