program: Gaussian 09
title: 000070769
version: EM64L-G09RevD.01
frameworkgroup: C1[X(C9H8N2)]
method: RPBEPBE
basis: SDD
operation: Freq
keyword: #p
keyword: freq=noraman
keyword: PBEPBE/SDD
title: #p freq=noraman PBEPBE/SDD
converged: NO YES NO NO
title: Mulliken charges:
elementType: N N C C C C C C C C C H H H H H H H H
charge: -0.204329 -0.058167 0.464160 -0.352757 -0.372181 -0.157847 -0.221304 -0.200094 -0.319019 -0.248996 -0.296956 0.224606 0.290179 0.253028 0.227032 0.229901 0.253062 0.231391 0.258290
chargesum: 0.00000
title: Mulliken charges with hydrogens summed into heavy atoms:
elementType: N N C C C C C C C C C
charge: -0.204329 -0.058167 0.464160 -0.128151 -0.082002 0.095180 0.005728 0.029808 -0.065957 -0.017604 -0.038665
polarizability: 1.71294218e+02 -8.49014093e-02 1.08922210e+02 -2.14740126e-03 5.14696679e-03 4.22928608e+01
1716.lowfreq: -14.4571 -6.3269 -6.1443 -0.0007 -0.0003 0.0008 16.6934 109.2283 184.5340
frequency: 15.1460 109.2256 184.5329 261.6100 363.1071 403.5094 445.2878 505.7953 610.3545 613.3919 644.0087 680.6584 691.8196 744.0935 766.5901 821.9379 838.9108 878.8673 903.3892 911.3560 918.4971 974.9418 986.9621 998.3571 1002.2644 1027.0956 1047.6141 1079.4259 1110.9180 1172.1975 1176.8699 1194.2019 1223.4257 1318.0197 1324.3992 1381.0596 1390.3327 1404.9217 1451.0685 1488.1385 1504.7641 1600.1430 1614.9935 3131.7801 3141.2173 3156.2203 3169.2927 3188.5742 3221.4078 3235.3869 3257.7308
redmass: 3.9203 4.5545 4.3057 4.5646 6.8845 2.8546 4.8876 3.1707 2.4869 6.4392 5.2925 6.3598 2.0171 1.3402 1.7225 1.2706 1.2595 1.3905 6.0903 4.0839 1.4222 1.3601 6.0894 1.3183 3.6258 1.8373 1.4595 1.5526 2.1633 1.0594 1.5097 1.2813 2.5469 2.3630 1.5593 3.9707 7.0482 3.7194 2.4521 2.9589 3.8204 6.7374 6.1633 1.0850 1.0894 1.0939 1.0994 1.0956 1.0921 1.0959 1.1098
irintensity: 2.3408 1.6339 2.2010 0.7942 1.7063 0.0002 1.7062 10.1700 3.1080 0.1041 3.8445 12.6688 23.6974 121.0746 73.5394 14.6595 1.3300 0.8579 2.1782 43.0523 8.9603 0.3534 0.5883 1.8614 10.6084 27.3131 4.6818 7.0338 14.1686 0.3523 6.9565 9.5320 11.0626 2.8887 13.4692 34.4936 44.0590 13.6764 6.4569 28.9733 118.2162 4.1039 59.4214 1.6737 11.5673 33.1666 15.4528 2.6176 2.3599 2.1974 1.5821
temp: 298.150 k
press: 1.00000 atm
elementType: 7 7 6 6 6 6 6 6 6 6 6 1 1 1 1 1 1 1 1
symmnumber: 1
zpe: 390495.9 jmol-1
zpe.correction: 0.148732 hartree
zpe.thermalcorrener: 0.157011 hartree
zpe.thermalcorrenthalpy: 0.157955 hartree
zpe.thermalcorrgfe: 0.113850 hartree
zpe.sumelectzpe: -456.473436 hartree
zpe.sumelectthermal: -456.465157 hartree
zpe.sumelectthermalent: -456.464212 hartree
zpe.sumelectthermalfe: -456.508317 hartree
dipole: -0.4285 1.9056 0.0008
dipole: 1.9531
quadrupole: -52.7559 -57.5080 -69.9695
quadrupole: 2.1253 0.0009 0.0000
quadrupole: 7.3219 2.5698 -9.8917 2.1253 0.0009 0.0000
hfenergy: -456.6221677 hartree
pointgroup: C01 [X(C9H8N2)]
dipole: -0.1674498 0.7499523 0.0003239 debye
dipolederiv: -1.179306 0.0208906 0.0000198 0.0306192 -0.0757786 -0.000015 0.0000546 -0.0000086 0.0123223 0.1369154 -0.1753518 -0.0001054 -0.47047 -0.2810707 -0.0000196 -0.0000063 -0.0000573 -0.1870999 1.3237609 -0.0010156 0.0000028 0.0482724 0.0463475 -0.0000501 -0.0000223 -0.0000098 0.06701 -0.2424322 0.0208383 -0.0000261 0.1883661 -0.0054944 -0.0000496 -0.0000208 -0.0000568 -0.1720527 -0.2844163 -0.0467051 -0.0000117 -0.2197396 -0.0367168 -0.0000118 -0.0000256 0.0000153 -0.1538248 0.6109355 0.0610303 0.0000125 0.3375392 -0.0563643 0.0000728 0.0000091 0.0000976 -0.1565681 0.0444122 -0.0352807 -0.0000088 -0.12028 0.1112535 -0.0000337 0.0000227 -0.0000316 -0.1500384 0.105205 0.0589455 -0.0000045 0.0922822 0.1442743 -0.0000372 -0.000019 -0.0000297 -0.1471161 -0.4144592 0.0756238 0.0000594 0.4148988 -0.0919916 0.000037 0.0001767 0.0000424 -0.2343872 -0.0179332 -0.0010502 -0.0000101 0.0436057 -0.1194514 0.0000048 -0.0000158 -0.0000039 -0.1746643 -0.2957101 0.0039595 0.0000252 -0.3581321 0.3025889 0.0001918 -0.0001667 0.0001572 -0.12623 0.0474381 -0.1058056 0.0000276 -0.0987876 -0.0388586 0.0000423 0.0000374 0.0000394 0.1634434 0.1276996 0.0663893 -0.0000132 0.0625426 0.0415907 0.0000219 -0.0000383 0.0000028 0.1723808 0.1091588 0.0745806 0.0000271 0.0548855 0.007098 -0.0000942 0.0000198 -0.0001071 0.2166825 0.0184206 0.0832098 -0.0000056 0.1066406 -0.0657196 0.0000272 -0.0000106 0.0000278 0.1581161 0.0258627 -0.0805252 0.0000129 -0.1023712 -0.0711217 0.0000277 0.0000211 0.0000264 0.1551673 -0.0035874 -0.0769925 -0.0000382 -0.0878657 0.0671504 -0.0000601 -0.0000093 -0.0000579 0.2093201 -0.1334011 -0.0053252 0.0000111 -0.0036006 0.0925061 0.0000099 0.000011 0.0000044 0.1684681 0.0214364 0.0625841 0.0000253 0.0815946 0.0297584 -0.0000642 -0.0000177 -0.0000505 0.1790709 unknown
polarizability: 171.2938271|-0.1776885|108.9226008|-0.0021397|0.0051502|42.2928608 unknown
InChI: InChI=1S/C9H8N2/c1-2-5-9(6-3-1)11-8-4-7-10-11/h1-8H
charge 0 multiplicity 1
19 atoms
N  1.023709 0.06882 -0.000311
N  1.727587 -1.141911 -0.000749
C  -0.409494 0.050691 -0.000288
C  -1.147504 1.260068 -0.00042
C  -1.08267 -1.195501 -0.000146
C  1.885222 1.160532 0.000029
C  -2.557861 1.216425 -0.000358
C  -2.492002 -1.223097 -0.000104
C  3.189586 0.654237 -0.000027
C  -3.239032 -0.021933 -0.000195
C  3.037036 -0.769101 -0.000678
H  -0.641297 2.230167 -0.000623
H  -0.488889 -2.112309 -0.000084
H  1.531103 2.187361 0.000483
H  -3.123027 2.154896 -0.000464
H  -3.007805 -2.189584 0.000012
H  4.113003 1.228251 0.000264
H  -4.333637 -0.04997 -0.000153
H  3.807273 -1.538242 -0.000989
