program: Gaussian 09
title: 000070778
version: EM64L-G09RevD.01
frameworkgroup: C1[X(C9H15NO2)]
method: RPBEPBE
basis: SDD
operation: Freq
keyword: #p
keyword: freq=noraman
keyword: PBEPBE/SDD
title: #p freq=noraman PBEPBE/SDD
converged: YES YES NO NO
title: Mulliken charges:
elementType: O O N C C C C C C C C C H H H H H H H H H H H H H H H
charge: -0.214509 -0.214470 -0.344420 0.368409 -0.027613 -0.551303 -0.551269 -0.773057 -0.750696 -0.750512 0.115770 0.116026 0.192602 0.260229 0.247070 0.246993 0.259834 0.225557 0.225999 0.230997 0.217910 0.218693 0.232064 0.217739 0.218643 0.232275 0.351040
chargesum: 0.00000
title: Mulliken charges with hydrogens summed into heavy atoms:
elementType: O O N C C C C C C C C C
charge: -0.214509 -0.214470 0.006620 0.368409 0.164989 -0.044003 -0.044442 -0.090504 -0.082030 -0.081855 0.115770 0.116026
polarizability: 1.18617871e+02 -7.09484522e-03 1.20107552e+02 3.20903256e+00 1.30170173e-02 8.08610848e+01
1716.lowfreq: -16.3516 -0.0010 -0.0009 -0.0009 14.6781 15.0003 53.0312 74.0400 110.6633
frequency: 52.9287 73.9606 110.5931 152.0841 165.4598 213.3515 239.0089 253.2686 278.3446 311.2099 325.8801 336.2357 360.5173 386.8586 436.5549 459.8409 515.8555 538.6899 566.5049 588.9289 602.5490 767.8983 800.5500 825.2440 883.7140 887.7330 913.2195 915.0708 915.6198 942.8007 957.2251 980.4471 1050.1714 1113.4191 1114.2006 1147.0710 1149.2839 1188.7689 1238.6177 1257.5594 1262.9001 1286.1272 1316.9338 1320.1386 1320.9798 1349.5798 1371.0943 1385.0655 1393.4020 1405.2814 1432.1190 1439.8216 1468.2480 1478.1690 1482.7428 1491.4884 1491.9626 1497.4548 1636.3038 1639.0588 2938.2192 2972.6149 2975.2675 2981.5915 2983.8428 2988.1585 3069.4819 3072.7924 3073.4365 3076.2030 3079.2779 3083.3166 3086.4540 3088.6661 3485.2035
redmass: 2.5668 3.1193 4.1976 5.5249 2.8357 1.1176 1.2397 1.0858 2.4191 3.0231 2.2478 2.5449 3.9207 3.4284 2.4557 4.2285 2.7894 3.3305 3.9492 3.3019 3.0886 3.1502 1.3720 3.3409 2.5662 1.7649 2.8096 2.0270 1.2299 2.1587 1.4400 1.7275 1.7931 2.3476 1.7527 1.5852 1.6177 1.9398 2.0885 2.1276 1.9703 1.7425 1.4347 5.3846 1.6119 1.4699 1.8890 1.2098 1.2087 1.1981 1.0851 1.0816 1.0500 1.0458 1.0575 1.0559 1.0529 1.0449 11.3667 5.3009 1.0832 1.0667 1.0661 1.0361 1.0363 1.0369 1.0994 1.0987 1.0966 1.0972 1.0961 1.0961 1.0963 1.0984 1.0760
irintensity: 0.0163 0.0059 5.9808 3.8823 0.9113 0.2284 0.2596 0.0238 1.2617 2.3692 0.9759 7.4788 0.8718 13.6530 3.0197 10.9201 0.6444 4.7437 16.7260 3.5104 2.1223 1.7617 96.6621 15.6980 10.0099 0.0123 1.4448 2.0894 1.4682 0.5165 0.0212 1.1064 19.9667 0.3118 8.6500 54.2037 2.0830 4.2000 8.8841 119.7457 17.1423 130.8381 2.6904 112.3305 2.9514 9.1439 12.0213 16.5690 21.2497 28.8715 3.5331 5.6613 2.7689 5.8543 3.6680 5.9610 2.7438 28.1561 131.7491 482.0013 32.5944 3.3893 22.0830 29.8769 17.0986 16.7035 0.1151 57.5285 2.4057 24.9392 53.4102 23.1658 24.1938 32.2326 36.5328
temp: 298.150 k
press: 1.00000 atm
elementType: 8 8 7 6 6 6 6 6 6 6 6 6 1 1 1 1 1 1 1 1 1 1 1 1 1 1 1
symmnumber: 1
zpe: 600768.4 jmol-1
zpe.correction: 0.228821 hartree
zpe.thermalcorrener: 0.241444 hartree
zpe.thermalcorrenthalpy: 0.242388 hartree
zpe.thermalcorrgfe: 0.190604 hartree
zpe.sumelectzpe: -556.246486 hartree
zpe.sumelectthermal: -556.233863 hartree
zpe.sumelectthermalent: -556.232919 hartree
zpe.sumelectthermalfe: -556.284703 hartree
dipole: -4.1126 -0.0003 -0.5450
dipole: 4.1486
quadrupole: -78.2226 -89.2301 -70.7565
quadrupole: 0.0019 0.3333 -0.0083
quadrupole: 1.1805 -9.8271 8.6466 0.0019 0.3333 -0.0083
hfenergy: -556.4753066 hartree
pointgroup: C01 [X(C9H15N1O2)]
dipole: 1.6175407 0.0007478 -0.2181136 debye
polarizability: 118.6029874|-0.0010905|120.1074612|-3.2954133|0.0606425|80.8760597 unknown
InChI: InChI=1S/C9H15NO2/c1-6(2)9(3)4-7(11)10-8(12)5-9/h6,10H,4-5H2,1-3H3
charge 0 multiplicity 1
27 atoms
O  -2.232718 -2.314379 0.000085
O  -2.23446 2.313659 0.006315
N  -2.168558 -0.000309 -0.024304
C  0.711373 0.000838 0.124637
C  2.169338 0.002015 -0.48237
C  -0.049444 -1.256108 -0.393984
C  -0.050689 1.257878 -0.392081
C  0.725358 -0.00025 1.676911
C  2.990825 1.26357 -0.11729
C  2.989203 -1.26316 -0.126204
C  -1.547737 -1.264023 -0.118633
C  -1.548765 1.264152 -0.115614
H  2.032739 0.005748 -1.587458
H  0.347441 -2.184505 0.048182
H  0.081291 -1.346552 -1.493219
H  0.079227 1.349426 -1.491317
H  0.345607 2.186226 0.050697
H  1.240241 -0.893646 2.071973
H  1.237615 0.894101 2.073124
H  -0.300301 -0.002104 2.089318
H  3.192792 1.31462 0.968449
H  3.968954 1.234324 -0.631081
H  2.490313 2.200556 -0.418134
H  3.184304 -1.326713 0.96014
H  3.970604 -1.227671 -0.633346
H  2.490934 -2.196741 -0.441036
H  -3.181986 -0.000952 0.14774
