program: Gaussian 09
title: 000070768
version: EM64L-G09RevD.01
frameworkgroup: C1[X(C10H17N)]
method: RPBEPBE
basis: SDD
operation: Freq
keyword: #pfreq=noraman
keyword: PBEPBE/SDD
title: #p freq=noraman PBEPBE/SDD
converged: YES YES NO NO
title: Mulliken charges:
elementType: N C C C C C C C C C C H H H H H H H H H H H H H H H H H
charge: -0.191377 -0.375326 -0.369634 -0.459319 -0.455091 0.402893 -0.485442 -0.408430 -0.404623 -0.426861 -0.405656 0.211961 0.220960 0.203640 0.225279 0.224953 0.218106 0.222550 0.220158 0.218783 0.212975 0.202479 0.196487 0.198081 0.199131 0.198055 0.194458 0.210808
chargesum: 0.00000
title: Mulliken charges with hydrogens summed into heavy atoms:
elementType: N C C C C C C C C C C
charge: -0.191377 0.057594 0.059285 -0.016260 -0.012383 0.402893 -0.053684 -0.009463 -0.007411 -0.034348 -0.194848
polarizability: 1.43501954e+02 -9.01007424e+00 1.11536185e+02 -3.83438365e-01 1.09776779e-01 8.19112048e+01
1716.lowfreq: -13.4800 -0.0005 0.0004 0.0005 2.6051 16.7426 59.4600 64.8350 129.3965
frequency: 59.2898 64.4185 129.3574 168.5563 173.4087 217.6614 239.4029 298.2528 325.0016 434.0166 447.5172 500.0628 521.2423 572.0081 690.1273 747.2425 763.6686 824.3131 838.1064 860.0732 870.0575 910.9276 912.2848 915.7428 922.5757 938.9604 984.6071 985.2776 1061.6998 1074.7043 1081.7346 1105.5846 1120.3720 1133.1513 1145.4469 1163.2204 1167.0864 1191.4502 1217.7631 1240.2249 1241.2187 1260.5426 1302.1995 1309.4707 1314.3973 1318.7560 1331.7364 1334.2370 1341.9172 1345.9501 1354.9636 1400.5516 1456.5185 1465.5384 1467.2148 1467.6674 1473.6577 1477.6962 1496.7146 1506.6698 1653.9598 2903.1862 2919.1804 2921.5087 2950.3560 2967.7239 2968.8985 2975.4233 2986.4394 3002.5970 3008.7168 3009.2089 3020.7245 3031.0319 3041.8872 3071.3882 3085.0411 3123.2162
redmass: 3.2453 2.6674 2.1384 3.2106 2.5956 2.2896 1.6651 2.4156 2.4850 3.7253 2.2468 2.7362 3.1852 1.8478 2.4982 1.5473 1.9653 1.4261 2.7023 1.8004 1.8062 1.6845 2.3745 2.4253 1.5622 2.0160 2.1801 1.9886 1.7981 1.7240 1.7615 1.4443 1.5495 1.1665 1.3513 1.6368 1.4789 2.5258 1.2876 1.2859 1.3659 1.2409 1.3541 1.2872 1.5073 1.3554 1.4617 1.4730 1.4897 1.5978 1.8967 3.6121 1.0961 1.0894 1.0930 1.0828 1.0961 1.0948 1.0795 1.0892 6.4090 1.0701 1.0662 1.0654 1.0631 1.0700 1.0963 1.0635 1.0826 1.0692 1.0646 1.0932 1.0843 1.0994 1.1041 1.1005 1.1053 1.0890
irintensity: 1.6020 0.3425 0.5462 0.7750 5.0211 1.4944 0.3073 0.8590 0.6368 2.2944 2.0568 0.2631 1.9860 3.3549 1.4211 34.1195 9.2193 6.6380 0.7360 1.1247 2.7138 1.1352 2.3957 7.8348 1.4012 4.7202 9.5176 2.5503 2.1999 0.7151 1.7523 0.8596 5.9647 4.7623 11.5013 3.4341 2.3953 17.2624 11.9147 11.1310 14.2354 5.3763 2.3782 4.2853 10.4147 2.9942 38.3697 4.7965 1.2781 18.2693 42.8203 124.6518 21.5356 7.6060 7.1128 10.4720 9.0118 1.7667 0.8772 12.3660 159.6672 123.3363 72.1197 53.3915 37.7068 16.6251 28.9816 40.2561 87.7014 13.0394 58.9646 34.5633 57.9162 72.7418 84.3794 37.9840 63.8055 36.6755
temp: 298.150 k
press: 1.00000 atm
elementType: 7 6 6 6 6 6 6 6 6 6 6 1 1 1 1 1 1 1 1 1 1 1 1 1 1 1 1 1
symmnumber: 1
zpe: 659888.3 jmol-1
zpe.correction: 0.251338 hartree
zpe.thermalcorrener: 0.262009 hartree
zpe.thermalcorrenthalpy: 0.262953 hartree
zpe.thermalcorrgfe: 0.214880 hartree
zpe.sumelectzpe: -445.121008 hartree
zpe.sumelectthermal: -445.110337 hartree
zpe.sumelectthermalent: -445.109393 hartree
zpe.sumelectthermalfe: -445.157466 hartree
dipole: 1.7049 -0.9015 0.0169
dipole: 1.9286
quadrupole: -64.3100 -66.5020 -69.5161
quadrupole: 0.9089 0.0341 -0.1143
quadrupole: 2.4660 0.2740 -2.7401 0.9089 0.0341 -0.1143
hfenergy: -445.3723461 hartree
pointgroup: C01 [X(C10H17N1)]
dipole: -0.6703076 0.3555416 0.0060506 debye
polarizability: 143.4766026|-9.0527314|111.5603002|0.4787979|-0.0753521|81.9124403 unknown
InChI: InChI=1S/C10H17N/c1-2-6-10(7-3-1)11-8-4-5-9-11/h6H,1-5,7-9H2
charge 0 multiplicity 1
28 atoms
N  -1.000829 0.011033 -0.025905
C  -1.823273 -1.211739 -0.065437
C  -1.821892 1.240196 -0.010428
C  -3.268213 -0.692248 -0.261645
C  -3.231056 0.723505 0.369628
C  0.401647 -0.037227 -0.023222
C  1.11493 1.314737 -0.026289
C  2.610284 1.192839 -0.395393
C  3.278923 0.046037 0.392131
C  2.622622 -1.303665 0.019606
C  1.104869 -1.221721 -0.0074
H  -1.714878 -1.792418 0.877771
H  -1.50564 -1.877965 -0.894473
H  -1.846927 1.739514 -1.00604
H  -1.443107 1.978111 0.721202
H  -4.018868 -1.352536 0.205039
H  -3.50076 -0.618374 -1.340208
H  -4.034324 1.383924 0.00015
H  -3.320548 0.650917 1.469363
H  0.614874 2.001553 -0.737579
H  1.019212 1.783982 0.9761
H  2.705903 0.988286 -1.480606
H  3.120016 2.156303 -0.199394
H  3.155875 0.23129 1.478351
H  4.366394 0.014144 0.186027
H  2.94263 -2.08383 0.740969
H  3.011204 -1.634819 -0.970027
H  0.563831 -2.175629 -0.014491
