program: Gaussian 09
title: 000070760
version: EM64L-G09RevD.01
frameworkgroup: C1[X(C9H13N)]
method: RPBEPBE
basis: SDD
operation: Freq
keyword: #pfreq=noraman
keyword: PBEPBE/SDD
title: #p freq=noraman PBEPBE/SDD
converged: YES YES NO NO
title: Mulliken charges:
elementType: N C C C C C C C C C H H H H H H H H H H H H H
charge: -0.049097 0.183525 -0.489162 0.469423 -0.476386 0.145483 -0.479283 -0.678861 -0.805920 -0.789050 0.203098 0.222990 0.239274 0.237701 0.242796 0.214809 0.211235 0.235705 0.226517 0.232893 0.251456 0.228110 0.222743
chargesum: 0.00000
title: Mulliken charges with hydrogens summed into heavy atoms:
elementType: N C C C C C C C C C
charge: -0.049097 0.183525 -0.063074 0.469423 -0.237112 0.145483 -0.241582 -0.010021 -0.110804 -0.086740
polarizability: 1.25491340e+02 -1.45741222e+00 1.17875204e+02 -5.03899208e+00 8.31565850e-01 6.50514308e+01
1716.lowfreq: -56.2981 -13.1619 -4.6915 -0.0009 -0.0008 -0.0007 7.2841 22.6580 38.7323
frequency: -56.1952 22.1777 38.6448 119.7926 179.6214 204.1802 215.9389 262.1607 282.8720 313.9459 451.5418 508.4907 526.4557 535.5787 567.4802 625.0537 755.9980 785.1780 866.6637 891.0196 904.6329 928.1602 964.8886 976.8977 1012.4951 1037.1154 1045.3791 1049.5002 1068.2749 1075.3316 1160.6428 1212.2280 1247.1820 1303.1026 1309.6570 1350.4526 1379.9355 1388.5187 1397.4171 1401.6405 1418.3867 1462.9810 1464.2385 1469.1842 1470.9489 1472.2616 1473.5564 1489.1600 1564.7724 1599.3528 2979.4786 2981.2583 2981.5811 2994.9357 3049.7620 3060.0049 3060.2840 3078.5882 3088.0888 3093.7183 3114.2943 3127.5664 3130.2996
redmass: 1.0210 1.0261 2.4448 3.1800 2.9175 1.2049 3.5757 2.5656 1.8794 3.1379 2.4875 5.6049 4.0909 3.2053 4.0605 3.1835 2.7905 1.2234 1.3596 2.8392 1.3508 3.0594 3.0955 2.2454 1.5445 2.4411 1.5553 1.6149 1.8513 1.6159 1.4306 1.4827 1.3742 1.5662 3.9053 3.3141 1.2422 1.3423 1.3611 2.2628 3.0305 1.1353 1.0908 1.0594 1.0621 1.0648 1.1157 1.0770 5.9879 5.6624 1.0373 1.0359 1.0372 1.0594 1.1016 1.0968 1.0970 1.1005 1.0993 1.1010 1.0982 1.0918 1.0930
irintensity: 0.3163 0.4522 0.5888 2.2688 1.8547 0.5535 0.8380 1.4398 1.6063 4.1331 1.0676 2.3440 2.7103 3.0204 0.7881 0.8218 4.3693 2.1853 23.8883 7.8356 0.5444 6.9593 1.2688 6.8350 1.6326 3.4980 1.2137 21.4850 12.2661 3.1525 0.2776 4.3628 0.8299 1.0807 3.1636 0.4829 8.5475 27.0667 10.3324 2.8589 16.5280 24.6070 9.2651 20.4543 6.6831 11.7078 42.9829 15.0627 71.1227 93.8103 29.4770 47.7653 16.5482 29.3107 7.8722 8.0721 31.7331 53.7136 17.9457 34.3387 9.9947 25.3437 6.1290
temp: 298.150 k
press: 1.00000 atm
elementType: 7 6 6 6 6 6 6 6 6 6 1 1 1 1 1 1 1 1 1 1 1 1 1
symmnumber: 1
zpe: 514340.1 jmol-1
zpe.correction: 0.195902 hartree
zpe.thermalcorrener: 0.206218 hartree
zpe.thermalcorrenthalpy: 0.207162 hartree
zpe.thermalcorrgfe: 0.158702 hartree
zpe.sumelectzpe: -404.761633 hartree
zpe.sumelectthermal: -404.751317 hartree
zpe.sumelectthermalent: -404.750373 hartree
zpe.sumelectthermalfe: -404.798833 hartree
dipole: -1.5748 -1.5254 0.2704
dipole: 2.2091
quadrupole: -56.0646 -57.0587 -63.0895
quadrupole: -2.1029 -1.0004 0.6211
quadrupole: 2.6730 1.6789 -4.3519 -2.1029 -1.0004 0.6211
hfenergy: -404.957535 hartree
pointgroup: C01 [X(C9H13N1)]
dipole: -0.5297406 -0.68594 0.0651987 debye
dipolederiv: -0.6169701 0.1252134 0.0424791 0.160656 -0.4705353 -0.0097419 0.06424 -0.0218828 -0.2513311 0.7403772 -0.0443066 -0.0546363 0.0947548 0.1628421 -0.0277488 -0.1034717 0.0137521 -0.0095799 -0.1370862 -0.0056132 -0.0264621 -0.11396 0.1512866 0.0106217 -0.1201139 -0.0069925 0.0607702 0.3271901 0.1139199 -0.0430626 0.1227745 0.4364442 -0.0035483 -0.0612692 -0.0100226 0.0159875 -0.4867527 -0.1160819 0.0121516 -0.2422981 -0.1175352 0.031658 0.0457701 0.0149837 -0.1663208 0.2750804 -0.0986175 -0.0384017 -0.2667277 0.6973675 0.0500319 -0.0448347 0.0202587 0.0394916 -0.0522601 -0.1048351 -0.0329905 0.0464779 -0.5621654 -0.0171534 -0.0093594 0.0011806 -0.1681598 0.0017674 -0.0046782 -0.0393317 0.0378337 0.052505 -0.0416744 0.0729869 -0.0374314 0.0192274 0.0362045 -0.0638738 0.0010144 -0.1448569 -0.1521512 0.0164212 0.018122 0.0317533 0.0476708 -0.0473429 0.1663586 0.0121886 0.1185921 -0.2093089 -0.0290274 -0.0073974 0.0065295 0.057669 0.0219278 0.0043747 -0.0002973 0.08023 -0.1354749 -0.1166682 0.0046744 -0.0698099 0.0349049 0.0138673 -0.0164528 0.0256443 -0.0433019 0.0104624 0.1206533 0.0483625 0.0773446 -0.0584797 0.0631809 0.075702 0.0216123 0.0889664 -0.0767463 -0.0257984 0.0221131 -0.0264051 0.1408685 -0.1182507 0.0283288 0.0413917 0.0085667 0.0944249 -0.0069874 0.0424977 -0.0116905 0.1460132 0.1178573 0.0733044 0.0249536 0.0269771 -0.081315 -0.0859854 0.0158197 -0.0500477 0.0521328 -0.2629303 -0.0108498 0.0120906 -0.0133001 0.1055055 -0.0064281 0.0090606 -0.0054502 0.0630428 0.090237 -0.0559227 0.0383561 -0.0150296 -0.0273064 0.1377326 -0.0068966 0.0950391 -0.0738872 0.0563183 0.002815 -0.0629616 -0.0193108 -0.0053071 0.0946098 -0.0186769 0.1279222 -0.0342533 -0.1421973 -0.0108198 0.0132751 0.1017578 0.0635658 -0.0074043 0.0176868 -0.0047754 0.106748 0.065258 -0.0048393 0.0563427 -0.0277221 -0.003799 -0.0943295 0.0015877 -0.1355776 -0.0394534 0.0030237 -0.1532941 -0.0154645 -0.0548586 0.0053529 -0.0128691 0.000877 -0.0147019 0.1108583 0.0230618 0.0663873 -0.1053971 0.0452602 0.0207629 0.0106986 -0.1156644 0.0632957 -0.0355829 0.0284384 0.0337806 0.1175052 0.0085185 0.041125 0.0129376 0.1238859 -0.0572719 -0.0583369 unknown
polarizability: 125.7658835|-0.0522706|117.4253937|-4.9981162|3.1994074|65.2266982 unknown
InChI: InChI=1S/C9H13N/c1-4-9-6-7(2)5-8(3)10-9/h5-6H,4H2,1-3H3
charge 0 multiplicity 1
23 atoms
N  0.455866 1.081166 -0.147012
C  0.982258 -0.177765 -0.307153
C  2.483442 -0.244013 -0.528156
C  -1.216731 -1.228123 -0.013256
C  0.179627 -1.339893 -0.246686
C  -0.886671 1.204318 0.075991
C  -1.744138 0.073318 0.148037
C  3.273267 0.121362 0.755406
C  -2.097798 -2.460265 0.064473
C  -1.429151 2.611949 0.229501
H  2.769367 -1.254874 -0.87408
H  2.751215 0.472982 -1.326778
H  0.640936 -2.32519 -0.381891
H  -2.816127 0.217937 0.325991
H  2.974948 1.125009 1.104975
H  4.361185 0.125428 0.560446
H  3.070633 -0.601211 1.567223
H  -1.844177 -3.073196 0.950165
H  -3.165781 -2.192135 0.134914
H  -1.963696 -3.104043 -0.824257
H  -0.591991 3.325234 0.28089
H  -2.069379 2.888048 -0.630099
H  -2.045306 2.711557 1.142055
