program: Gaussian 09
title: 000070740
version: EM64L-G09RevD.01
frameworkgroup: C1[X(C7H5NO)]
method: RPBEPBE
basis: SDD
operation: Freq
keyword: #pfreq=noraman
keyword: PBEPBE/SDD
title: #p freq=noraman PBEPBE/SDD
converged: YES YES NO NO
title: Mulliken charges:
elementType: O N C C C C C C C H H H H H
charge: -0.224813 -0.057409 0.413323 -0.347797 -0.359649 -0.199281 -0.188144 -0.239835 -0.047144 0.268889 0.265748 0.238611 0.239800 0.237701
chargesum: 0.00000
title: Mulliken charges with hydrogens summed into heavy atoms:
elementType: O N C C C C C C C
charge: -0.224813 -0.057409 0.413323 -0.078908 -0.093901 0.039330 0.051656 -0.002134 -0.047144
polarizability: 1.19260453e+02 7.56145524e+00 8.13570500e+01 -1.82658102e-03 -1.57592116e-03 3.28909978e+01
1716.lowfreq: -7.9943 -0.0008 -0.0004 -0.0004 7.2250 11.0854 64.1205 122.7112 222.7831
frequency: 64.1154 122.7100 222.7818 346.5394 409.7549 432.4762 456.5972 487.5385 605.8854 618.2390 688.2353 742.4528 761.3285 831.0476 910.8355 970.5178 986.7853 994.1009 1009.0503 1029.9873 1079.8649 1157.1366 1173.5979 1184.1721 1313.1765 1387.9396 1446.9797 1469.9985 1595.8046 1615.5642 2186.4870 3139.4764 3146.7040 3157.6320 3171.0923 3182.0438
redmass: 7.0300 8.1208 5.3195 6.1671 2.8959 9.3163 12.6435 3.0875 6.5643 9.2116 2.3568 7.4783 1.4608 1.2473 1.3967 1.3679 6.3285 1.3153 4.9125 2.5255 1.5038 2.5636 1.0868 1.3621 1.3034 10.0610 2.2634 2.1972 6.0956 7.2292 12.6516 1.0860 1.0893 1.0938 1.0972 1.1001
irintensity: 0.7794 2.9367 0.0736 1.9096 0.0001 2.0483 3.1268 11.9053 0.7280 2.6307 27.1416 19.7592 105.8630 0.0357 9.2940 0.0134 5.1696 0.6262 3.5012 33.0028 10.4896 176.9898 8.6395 46.7420 0.2988 0.1916 6.3477 99.6945 47.7655 17.8193 191.6115 1.0218 5.4050 11.6311 12.7669 4.7253
temp: 298.150 k
press: 1.00000 atm
elementType: 8 7 6 6 6 6 6 6 6 1 1 1 1 1
symmnumber: 1
zpe: 263768.5 jmol-1
zpe.correction: 0.100464 hartree
zpe.thermalcorrener: 0.107796 hartree
zpe.thermalcorrenthalpy: 0.108740 hartree
zpe.thermalcorrgfe: 0.068123 hartree
zpe.sumelectzpe: -399.044082 hartree
zpe.sumelectthermal: -399.036751 hartree
zpe.sumelectthermalent: -399.035807 hartree
zpe.sumelectthermalfe: -399.076423 hartree
dipole: -4.7282 -0.3598 0.0001
dipole: 4.7419
quadrupole: -60.2470 -45.9811 -54.6329
quadrupole: -2.8125 -0.0008 0.0001
quadrupole: -6.6267 7.6392 -1.0126 -2.8125 -0.0008 0.0001
hfenergy: -399.1445463 hartree
pointgroup: C01[X(C7H5N1O1)]
dipole: -1.8433313 -0.2439546 -0.1520108 debye
dipolederiv: -1.79131 -0.281695 -0.1477816 -0.4969682 -0.3325398 -0.0602926 -0.167859 -0.0452741 -0.0754206 -0.4496104 -0.0012413 -0.0141981 -0.1340242 -0.2269799 -0.0072422 -0.0263498 0.002206 -0.2532179 1.574901 -0.0562808 0.0971883 -0.281078 0.1685469 -0.0147241 0.0761617 0.0010401 0.1198544 -0.2479007 0.0304193 -0.0035856 0.2201534 -0.1207344 0.0187427 0.0141044 0.0054004 -0.1550136 -0.3483053 -0.0301731 -0.0159826 -0.0945363 0.0200353 0.0102885 -0.0219859 0.0148745 -0.1611192 0.047242 -0.004698 0.0124586 -0.0491574 0.1513937 0.0234428 0.0083171 0.0266439 -0.1337797 0.1437327 0.0444458 0.0240905 0.0287824 0.0857248 0.0230879 0.0226058 0.0241473 -0.1371589 0.0429432 -0.0716513 0.0079912 -0.0123214 -0.1280673 0.0026796 0.0135216 -0.0014977 -0.1652735 0.9353139 0.3856306 0.0952197 0.8326021 0.3218185 0.0797911 0.1367459 0.0483711 0.1080056 0.0334071 -0.0604165 -0.0162626 -0.0791092 0.0649051 -0.0167405 -0.0180044 -0.0154152 0.1825306 0.1036773 0.0519557 -0.0008662 0.0520235 -0.0080508 -0.0143815 -0.0008636 -0.0144177 0.183829 0.0601229 0.0393543 -0.0033986 0.0552063 -0.0737734 -0.0180096 -0.0019227 -0.0191659 0.1590022 -0.0113121 -0.0926095 -0.0207182 -0.0912578 -0.0027437 -0.0216693 -0.020591 -0.0217497 0.1579034 -0.0929016 0.0469598 -0.0141546 0.0496847 0.0804651 -0.004973 -0.0138803 -0.005163 0.1698582 unknown
polarizability: 117.7611507|9.2400075|81.8934003|6.8132006|5.2101737|33.8539501 unknown
InChI: InChI=1S/C7H5NO/c8-6-9-7-4-2-1-3-5-7/h1-5H
charge 0 multiplicity 1
14 atoms
O  1.50203 -0.812779 0.028869
N  3.437496 0.779249 0.313046
C  0.126649 -0.34585 -0.024018
C  -0.204571 1.016717 0.079607
C  -0.830559 -1.361726 -0.185773
C  -1.573057 1.368561 0.016346
C  -2.190912 -0.987435 -0.246306
C  -2.564621 0.374073 -0.145782
C  2.486451 0.060985 0.17963
H  0.570837 1.780499 0.205017
H  -0.511988 -2.405093 -0.260809
H  -1.857934 2.422838 0.094702
H  -2.955636 -1.760743 -0.371834
H  -3.620987 0.657104 -0.193494
