program: Gaussian 09
title: 000070728
version: EM64L-G09RevD.01
frameworkgroup: C1[X(C4Cl2O3)]
method: RPBEPBE
basis: SDD
operation: Freq
keyword: #pfreq=noraman
keyword: PBEPBE/SDD
title: #p freq=noraman PBEPBE/SDD
converged: NO NO NO NO
title: Mulliken charges:
elementType: Cl Cl O O O C C C C
charge: 0.101680 0.101678 -0.204995 -0.119732 -0.119728 -0.131251 -0.131246 0.251798 0.251797
chargesum: 0.00000
title: Mulliken charges with hydrogens summed into heavy atoms:
polarizability: 1.10752986e+02 -1.77001182e-04 7.66655150e+01 2.26523697e-03 2.89501462e-04 2.65287392e+01
1716.lowfreq: -0.0040 -0.0036 -0.0029 13.5723 15.6705 18.1486 89.8170 150.9213 160.5159
frequency: 89.8153 150.9213 160.5079 220.9225 239.0456 324.8194 382.9150 437.4019 487.0441 593.3359 644.8543 678.9475 718.2444 775.2848 831.7263 931.7125 1123.8910 1127.6410 1594.4934 1692.1877 1749.2003
redmass: 20.9620 30.0413 15.5587 19.5861 13.6416 18.7111 20.9473 12.4034 18.2344 14.5104 13.2792 12.5023 12.1729 14.2624 13.5080 13.6160 12.1998 12.4614 12.0369 13.1954 13.0572
irintensity: 0.0000 0.0319 2.6356 2.1096 1.2950 1.3699 0.0624 0.0000 13.7452 0.6419 5.2070 27.9252 0.0000 164.3214 1.4254 87.6978 105.9509 90.8508 108.3718 493.9106 71.2195
temp: 298.150 k
press: 1.00000 atm
elementType: 17 17 8 8 8 6 6 6 6
symmnumber: 1
zpe: 89450.2 jmol-1
zpe.correction: 0.034070 hartree
zpe.thermalcorrener: 0.041963 hartree
zpe.thermalcorrenthalpy: 0.042907 hartree
zpe.thermalcorrgfe: 0.000152 hartree
zpe.sumelectzpe: -1297.540725 hartree
zpe.sumelectthermal: -1297.532833 hartree
zpe.sumelectthermalent: -1297.531888 hartree
zpe.sumelectthermalfe: -1297.574643 hartree
dipole: -0.0001 -3.2977 -0.0001
dipole: 3.2977
quadrupole: -72.2578 -69.8267 -61.0661
quadrupole: -0.0001 0.0005 -0.0002
quadrupole: -4.5409 -2.1098 6.6507 -0.0001 0.0005 -0.0002
hfenergy: -1297.5747952 hartree
pointgroup: C01 [X(C4Cl2O3)]
dipole: 0.0001217 -1.2973959 -0.000056 debye
dipolederiv: -0.28815 0.2707266 -0.0000267 0.4233712 -0.3606061 0.0000389 -0.0000469 0.0000375 0.0678682 -0.2880081 -0.2707122 -0.0000326 -0.4233553 -0.3607498 -0.0000426 -0.0000496 -0.0000397 0.0678667 -1.1409171 -0.0000472 0.0000313 -0.0000378 -0.7335554 0.000015 0.0000343 0.0000133 -0.2081046 -0.9609593 -0.1942635 0.0000142 -0.2911047 -0.4907059 0.0000023 -0.0000203 -0.0000058 -0.2776366 -0.961072 0.1941706 0.000023 0.2910097 -0.4906053 -0.0000069 0.0000439 -0.000012 -0.2776332 0.2969419 -0.7958426 0.0000421 -0.9571264 0.1664489 -0.0000887 0.0000579 -0.0000448 -0.0416828 0.2965604 0.7958729 0.0000566 0.9571607 0.16681 0.0000942 0.0000733 0.0000615 -0.0416844 1.5227346 0.2325458 -0.0000197 0.3211397 1.0515345 0.0000049 -0.0000053 -0.0000079 0.3555025 1.5228695 -0.2324505 -0.0000882 -0.321057 1.0514291 -0.0000169 -0.0000874 -0.0000021 0.3555042 unknown
polarizability: 110.7529856|0.0036418|76.6655154|0.0022652|0.0002898|26.5287392 unknown
InChI: InChI=1S/C4Cl2O3/c5-1-2(6)4(8)9-3(1)7
charge 0 multiplicity 1
9 atoms
Cl 1.795698 -2.047015 0.000149
Cl -1.795274 -2.047388 -0.00016
O  -0.00016 1.589031 -0.000051
O  2.320333 1.191616 0.000007
O  -2.320584 1.191122 0.000094
C  0.682683 -0.679907 0.000006
C  -0.682539 -0.680049 -0.000013
C  1.175113 0.741369 -0.000041
C  -1.175269 0.741121 0.000008
