program: Gaussian 09
title: 000070718
version: EM64L-G09RevD.01
frameworkgroup: C1[X(C6H6OS)]
method: RPBEPBE
basis: SDD
operation: Freq
keyword: #pfreq=noraman
keyword: PBEPBE/SDD
title: #p freq=noraman PBEPBE/SDD
converged: YES YES NO NO
title: Mulliken charges:
elementType: S O C C C C C C H H H H H H
charge: -0.016019 -0.413250 -0.439085 0.369117 -0.193008 -0.319817 -0.246235 -0.189975 0.252216 0.254846 0.232612 0.231838 0.125010 0.351751
chargesum: 0.00000
title: Mulliken charges with hydrogens summed into heavy atoms:
elementType: S O C C C C C C
charge: 0.108991 -0.061499 -0.439085 0.369117 0.059207 -0.064971 -0.013623 0.041863
polarizability: 1.11526195e+02 8.56691476e-01 8.70701213e+01 2.38669170e+00 -4.72506598e-01 4.09438325e+01
1716.lowfreq: -7.2088 -0.0021 0.0002 0.0018 2.8040 8.7731 148.9064 221.1277 242.2823
frequency: 148.9042 221.1251 242.2819 260.4149 355.2958 434.5367 468.1488 527.7395 540.4783 597.4976 657.7155 704.4791 759.0600 810.9723 848.9689 872.6669 944.2553 981.2615 1013.3650 1033.5485 1115.7287 1165.9963 1182.9929 1234.6468 1310.4519 1389.8404 1446.0065 1456.8952 1586.5316 1605.6305 2386.8681 3136.7147 3148.9874 3166.2497 3177.3174 3383.8255
redmass: 4.5594 1.4246 7.5475 2.3463 8.3977 3.0672 4.9256 3.1166 7.8526 1.0987 6.7574 2.9494 1.3046 5.9995 1.2455 1.3529 1.3656 1.3176 4.6537 2.2434 1.6105 1.0638 1.4277 2.0566 1.6044 5.1697 2.3468 2.8039 6.0652 6.6619 1.0387 1.0858 1.0907 1.0955 1.0996 1.0640
irintensity: 0.9260 21.5052 2.5875 8.9837 3.9643 7.1351 13.2243 12.7410 2.3461 110.5581 7.1317 1.9381 96.3314 16.0356 0.5933 7.6249 1.3924 0.2509 22.0557 4.6938 0.0748 1.2197 201.9084 16.6672 15.4344 22.1038 1.1514 89.1858 23.4308 19.0775 26.8538 2.8113 8.5012 15.7714 11.0661 77.0550
temp: 298.150 k
press: 1.00000 atm
elementType: 16 8 6 6 6 6 6 6 1 1 1 1 1 1
symmnumber: 1
zpe: 265076.9 jmol-1
zpe.correction: 0.100962 hartree
zpe.thermalcorrener: 0.108179 hartree
zpe.thermalcorrenthalpy: 0.109124 hartree
zpe.thermalcorrgfe: 0.069371 hartree
zpe.sumelectzpe: -704.931318 hartree
zpe.sumelectthermal: -704.924101 hartree
zpe.sumelectthermalent: -704.923157 hartree
zpe.sumelectthermalfe: -704.962909 hartree
dipole: -0.1952 -1.2055 1.0955
dipole: 1.6406
quadrupole: -47.0033 -54.9892 -56.4506
quadrupole: 1.3338 3.2242 -1.0287
quadrupole: 5.8111 -2.1748 -3.6363 1.3338 3.2242 -1.0287
hfenergy: -705.0322802 hartree
pointgroup: C01 [X(C6H6O1S1)]
dipole: -0.1913524 -0.4685141 0.4006168 debye
dipolederiv: -0.1280892 -0.064636 -0.0308083 -0.0011666 -0.2550716 -0.0066911 -0.0960734 0.0033553 0.2480226 -0.9411946 -0.4696175 -0.0216068 -0.5180127 -0.6182136 0.0308395 -0.0355795 0.0014317 -0.3877336 0.2705422 -0.1136956 -0.0215733 -0.442174 -0.0811183 0.0272272 0.156602 -0.0716958 -0.2268154 0.6845663 0.6573262 0.0233856 0.4927288 0.403663 -0.0085526 0.0008144 -0.0155509 0.1103015 0.0441968 -0.1097449 -0.0152206 0.1747489 0.0207478 0.0043437 0.0054936 0.0288543 -0.0724597 -0.2565856 -0.2807672 -0.0189743 0.0972658 0.0336065 0.0132719 0.0063021 0.0416848 -0.1801514 -0.114508 0.172158 0.0060874 0.0874016 -0.1659221 0.012283 -0.0052695 -0.0003969 -0.203906 0.1455413 0.0502337 -0.0149404 -0.0747955 0.2053337 0.0300516 -0.0170705 0.0279667 -0.1283918 0.1006263 0.0372707 0.0085573 0.0126687 -0.0556261 -0.0195642 0.0101121 -0.0217298 0.1530805 0.0744821 0.0119725 0.0044713 0.0231622 -0.0588009 -0.0202751 0.007158 -0.0195785 0.1732274 -0.0623136 -0.0844209 -0.0003298 -0.0893123 0.0121552 -0.0128056 -0.0017706 -0.0123486 0.1737393 -0.087875 0.0789301 0.0161445 0.0802061 0.0606687 -0.0121099 0.0192188 -0.0133494 0.1556308 -0.0349238 0.074556 0.0535261 0.0636067 0.1117308 -0.0059589 -0.0622787 0.0609242 -0.1472793 0.3055348 0.0404351 0.0112816 0.0936722 0.3868467 -0.0320594 0.0123411 -0.0095669 0.332735 unknown
polarizability: 110.1537898|-5.8210605|88.3406762|-0.6366671|2.9784078|41.0456827 unknown
InChI: InChI=1S/C6H6OS/c7-5-3-1-2-4-6(5)8/h1-4,7-8H
charge 0 multiplicity 1
14 atoms
S  2.315627 -1.385879 -0.318292
O  1.525752 1.575679 0.01672
C  0.596591 -0.705631 -0.134519
C  0.439453 0.703346 -0.010827
C  -0.534426 -1.547436 -0.179944
C  -0.860087 1.255899 0.092784
C  -1.830791 -0.995055 -0.07555
C  -1.984134 0.406626 0.06326
H  -0.393882 -2.626877 -0.295755
H  -0.959882 2.340862 0.189767
H  -2.707902 -1.649014 -0.106463
H  -2.986471 0.841654 0.142541
H  2.556034 -1.612237 1.03252
H  2.361818 1.044963 -0.127542
