program: Gaussian 09
title: 000070716
version: EM64L-G09RevD.01
frameworkgroup: C1[X(C4H8O3S)]
method: RPBEPBE
basis: SDD
operation: Freq
keyword: #pfreq=noraman
keyword: PBEPBE/SDD
title: #p freq=noraman PBEPBE/SDD
converged: YES YES NO NO
title: Mulliken charges:
elementType: S O O O C C C C H H H H H H H H
charge: 1.039374 -0.340469 -0.510590 -0.504252 -0.316202 -0.405529 -0.304640 -0.670806 0.310410 0.248788 0.237899 0.220812 0.250081 0.261471 0.232572 0.251083
chargesum: 0.00000
title: Mulliken charges with hydrogens summed into heavy atoms:
elementType: S O O O C C C C
charge: 1.039374 -0.340469 -0.510590 -0.504252 -0.005792 0.081158 0.166252 0.074319
polarizability: 8.69117556e+01 2.93124020e+00 7.84404022e+01 5.92884739e-01 -2.21498479e+00 6.84042155e+01
1716.lowfreq: -11.9897 -7.0699 -0.0018 0.0011 0.0020 14.0847 51.8885 148.2743 185.5805
frequency: 51.7212 148.2514 185.5767 190.5797 214.6658 263.1970 282.3275 327.5451 403.5588 436.4878 456.9417 470.6960 569.1816 828.8204 849.0469 855.0288 937.9534 948.3072 972.1023 982.7318 1015.1485 1109.4841 1129.9109 1148.9756 1186.7522 1224.5078 1286.4308 1328.2585 1348.8838 1400.6202 1437.5569 1457.4212 1459.2338 1470.1256 2982.0740 2988.8067 3007.8968 3060.5777 3074.8057 3080.9836 3086.9384 3107.6192
redmass: 3.8695 4.0635 1.7520 1.6995 3.5818 8.1769 4.3464 3.4622 4.0917 5.8687 5.9497 4.6461 3.0588 3.1876 1.9553 10.9286 1.8992 2.7718 1.6538 3.3083 1.7740 2.0981 1.6176 1.3940 1.3589 1.3751 1.3041 1.2039 1.4324 1.1866 1.0997 1.0458 1.0822 1.0516 1.0633 1.0375 1.0600 1.0907 1.0999 1.0981 1.1020 1.1001
irintensity: 0.5592 0.2205 2.9091 1.0221 13.1714 3.8788 7.4947 6.9136 0.7193 15.5332 48.0512 15.9828 43.6902 18.1683 8.2710 78.1388 10.3639 69.9181 12.4409 8.0200 41.3895 0.4147 1.7147 11.3545 5.9970 17.9819 9.7472 9.9819 6.3902 19.8795 8.3059 13.3274 7.1791 12.2188 50.1475 8.7305 14.4720 0.9148 1.6531 4.0016 19.4588 12.5739
temp: 298.150 k
press: 1.00000 atm
elementType: 16 8 8 8 6 6 6 6 1 1 1 1 1 1 1 1
symmnumber: 1
zpe: 315621.1 jmol-1
zpe.correction: 0.120214 hartree
zpe.thermalcorrener: 0.129351 hartree
zpe.thermalcorrenthalpy: 0.130295 hartree
zpe.thermalcorrgfe: 0.086138 hartree
zpe.sumelectzpe: -780.132189 hartree
zpe.sumelectthermal: -780.123051 hartree
zpe.sumelectthermalent: -780.122107 hartree
zpe.sumelectthermalfe: -780.166264 hartree
dipole: -6.7512 2.1707 1.4218
dipole: 7.2327
quadrupole: -57.0782 -53.7054 -60.2186
quadrupole: 1.8017 -0.7126 1.2183
quadrupole: -0.0775 3.2954 -3.2179 1.8017 -0.7126 1.2183
hfenergy: -780.2524023 hartree
pointgroup: C01 [X(C4H8O3S1)]
dipole: 2.5472748 -1.1391072 0.5578059 debye
dipolederiv: 1.4730711 0.099401 -0.025347 0.2383526 1.1984723 0.0577552 -0.1122623 0.0484102 1.1628967 -0.7349617 -0.1590632 -0.0257804 -0.1136997 -0.6542778 0.0199153 -0.0383641 0.007524 -0.3979735 -0.6444737 0.073595 0.0466922 0.0688566 -0.4922043 -0.0354822 0.2036771 -0.0448913 -0.5967729 -0.6169701 0.0183754 -0.0774544 -0.0433926 -0.5010956 -0.0589746 -0.178646 -0.0771663 -0.5686433 0.2406733 -0.1125546 0.0233973 -0.1311838 0.2392228 -0.0119725 0.0607025 -0.0106164 0.0270881 -0.0991439 -0.0181401 0.0204714 0.0393981 -0.2338283 0.0199972 -0.1542231 0.0190492 0.0909538 0.4114178 0.0816479 0.0695414 -0.1427854 0.2057282 0.0361651 0.2920941 0.2133511 0.3170435 -0.054509 0.1335769 -0.0123972 -0.0118066 -0.1525684 -0.0509849 -0.0465423 -0.0000243 -0.012308 -0.0020869 0.0415231 -0.0004967 0.0215042 0.0042494 -0.0310591 0.0150429 -0.0160754 -0.0508034 0.0860184 -0.0087371 -0.0046923 0.0027136 0.0305025 -0.0557447 0.0611079 -0.0596033 -0.0743209 -0.0879132 0.0493228 -0.0757057 0.0355086 0.1194869 0.0218215 -0.0576529 0.0156318 0.0570387 -0.0054522 -0.0037361 -0.0046871 0.0301732 0.0396607 -0.0371908 -0.1056376 -0.1240493 -0.1464222 -0.0548643 -0.1086547 0.0457405 -0.0507723 0.0557651 0.0356386 0.0069151 0.0287686 0.059695 0.1153448 -0.0506422 -0.0183088 -0.0040698 0.1086766 0.0558013 0.0000983 -0.0121786 -0.0482662 -0.0203322 0.0774679 -0.0345891 0.1034437 -0.0186531 0.0177744 -0.022663 -0.010207 0.1224638 -0.005818 -0.1133818 0.0736158 -0.0422404 0.0508631 0.0165403 0.0763535 0.0220769 0.0583308 unknown
polarizability: 87.4348894|1.967786|77.8300629|-0.1674383|2.4629834|68.491421 unknown
InChI: InChI=1S/C4H8O3S/c1-4-2-3-7-8(4,5)6/h4H,2-3H2,1H3
charge 0 multiplicity 1
16 atoms
S  -0.986625 0.209698 -0.002452
O  0.163416 1.632907 -0.585275
O  -1.815956 0.658114 1.311863
O  -1.762315 -0.343186 -1.305825
C  0.594938 -0.941481 0.524614
C  1.774021 -0.152612 -0.043751
C  1.467766 1.36814 0.045592
C  0.341677 -2.335897 -0.030297
H  0.51076 -0.861854 1.621898
H  1.940203 -0.434623 -1.098732
H  2.690799 -0.381173 0.53144
H  1.472778 1.719059 1.097261
H  2.193913 1.952539 -0.544636
H  0.167913 -2.305624 -1.120165
H  1.22992 -2.968374 0.15861
H  -0.529607 -2.818533 0.443254
