program: Gaussian 09
title: 000070705
version: EM64L-G09RevD.01
frameworkgroup: C1[X(C7H12O2)]
method: RPBEPBE
basis: SDD
operation: Freq
keyword: #pfreq=noraman
keyword: PBEPBE/SDD
title: #p freq=noraman PBEPBE/SDD
converged: YES YES NO NO
title: Mulliken charges:
elementType: O O C C C C C C C H H H H H H H H H H H H
charge: -0.417759 -0.230805 -0.364183 -0.363367 -0.456274 -0.486627 -0.033792 0.174717 -0.595038 0.219571 0.215032 0.192385 0.209685 0.201954 0.207582 0.253594 0.251808 0.212471 0.215119 0.218288 0.375641
chargesum: 0.00000
title: Mulliken charges with hydrogens summed into heavy atoms:
elementType: O O C C C C C C C
charge: -0.042118 -0.230805 0.037887 0.071235 -0.046739 0.018775 0.178679 0.174717 -0.161631
polarizability: 1.11028680e+02 -1.07896010e+00 7.12499869e+01 -8.00148517e+00 -2.59973985e+00 6.23706688e+01
1716.lowfreq: -6.7686 -0.0006 -0.0005 0.0006 3.8192 12.5536 29.7569 43.2474 67.1511
frequency: 26.9413 43.2062 67.1255 93.9726 109.3597 129.2594 206.4313 270.2284 355.9541 425.9089 482.7914 500.4583 582.2502 636.4396 638.6373 727.5138 782.5759 856.1120 892.3139 922.6624 942.8005 1000.4794 1008.6917 1031.9422 1037.2572 1072.3908 1090.2374 1117.3928 1182.0427 1224.2416 1239.5250 1255.0899 1280.3161 1285.5423 1292.6056 1307.9406 1346.4586 1372.5640 1425.0903 1437.3932 1460.4649 1467.4023 1483.3247 1658.2884 1670.4652 2953.8232 2964.4621 2986.6260 2995.4153 3007.0247 3026.9757 3036.3542 3062.5675 3071.7179 3090.4361 3194.0734 3512.2887
redmass: 3.1036 3.7925 2.8495 2.9509 2.1480 2.2510 3.2495 4.8660 2.8492 2.2441 3.3062 1.7740 4.0120 1.3233 1.6063 1.1126 1.3072 4.5546 1.3816 2.0108 1.3428 1.1652 2.0634 2.6384 2.2226 2.4764 2.5129 1.4829 1.7683 1.3120 1.3179 1.4668 1.1572 1.1323 1.1511 1.4738 1.5614 1.8563 1.1814 1.0853 1.0918 1.0807 1.0993 4.7614 8.2493 1.0621 1.0608 1.0614 1.0604 1.0952 1.0984 1.1006 1.1022 1.0801 1.0741 1.1146 1.0639
irintensity: 0.3902 0.1226 0.3614 0.5980 0.1092 0.2202 2.1965 1.4459 1.3997 9.7343 20.3861 29.5154 20.1203 133.2841 9.7485 15.3440 4.0444 0.3632 4.9354 10.0426 77.1655 7.0850 154.4417 42.7698 29.9828 44.9588 39.4512 3.3066 6.3442 11.8478 0.1054 8.0790 2.9853 0.5041 2.2605 21.8301 18.1929 31.0407 3.9465 29.3703 2.9357 0.3719 20.8667 19.7722 211.2945 14.3401 37.6466 4.6508 35.6292 7.4975 6.5787 10.4831 54.1134 55.2479 6.8173 31.8887 18.2903
temp: 298.150 k
press: 1.00000 atm
elementType: 8 8 6 6 6 6 6 6 6 1 1 1 1 1 1 1 1 1 1 1 1
symmnumber: 1
zpe: 462607.0 jmol-1
zpe.correction: 0.176198 hartree
zpe.thermalcorrener: 0.187041 hartree
zpe.thermalcorrenthalpy: 0.187985 hartree
zpe.thermalcorrgfe: 0.137681 hartree
zpe.sumelectzpe: -423.656465 hartree
zpe.sumelectthermal: -423.645622 hartree
zpe.sumelectthermalent: -423.644678 hartree
zpe.sumelectthermalfe: -423.694982 hartree
dipole: 0.0156 -1.4359 0.1193
dipole: 1.4409
quadrupole: -52.7879 -61.1641 -53.4758
quadrupole: 2.5229 0.2036 -1.6375
quadrupole: 3.0213 -5.3548 2.3335 2.5229 0.2036 -1.6375
hfenergy: -423.8326631 hartree
pointgroup: C01 [X(C7H12O2)]
dipole: -0.0099208 -0.5621351 -0.0726137 debye
dipolederiv: -1.0286757 0.5528895 -0.010755 0.4879972 -0.6405186 0.017566 -0.0232618 0.0233715 -0.4338349 -0.6878706 -0.1620286 -0.0108173 0.0965905 -0.9718234 0.0013171 -0.0172873 -0.0125375 -0.3043922 0.0093648 -0.0005575 -0.0010249 -0.0676514 0.0799385 0.0337964 -0.0286362 0.0063632 0.1957706 0.0230331 -0.0045708 -0.0031788 0.0462885 0.054266 -0.0152936 0.0017884 -0.0073583 0.1590968 -0.1401033 -0.0354279 0.0106246 -0.0516986 0.1030216 -0.0486018 0.0368178 -0.0270405 0.147213 -0.2857804 -0.0959939 -0.0128642 -0.2964422 -0.0918668 -0.003693 -0.0209624 -0.0056323 0.1534477 0.2284088 0.1380088 -0.0990469 0.2933324 -0.0471777 0.1276553 -0.0508594 0.1567575 0.0557257 1.5001575 -0.1826383 0.0436124 -0.2522788 1.3955046 -0.005355 0.0587745 0.0014192 0.1864487 -0.2457065 0.144901 0.0080701 0.1239202 -0.1976992 0.2178175 0.042871 0.2216723 -0.1200953 0.0542094 0.00846 0.004233 0.0088199 -0.0092428 -0.1001761 -0.0133801 -0.1087089 -0.065718 0.0507328 -0.0007053 0.0044711 0.0029402 -0.0147103 0.1037536 0.019684 0.1135782 -0.0650164 0.0447037 0.0047017 -0.0056462 -0.0061594 -0.0387161 -0.1126791 -0.0019489 -0.1394122 -0.0925022 0.0392897 -0.0016224 0.0023883 0.0018951 -0.037772 0.1073644 -0.0011325 0.129342 -0.0748229 0.0166169 -0.0443387 0.0553001 -0.0437387 -0.0194662 0.1148643 0.007824 0.1336345 -0.0618233 0.0281826 0.0051461 0.0054838 0.0002043 -0.0148345 -0.0935611 -0.0205359 -0.137442 -0.079006 0.0664217 -0.0139446 0.0033426 0.0353857 0.0333198 0.0860628 -0.008532 0.1075441 -0.012881 0.0647453 -0.0044356 0.0007958 0.0414284 0.0367382 -0.0833688 0.0160084 -0.1085035 -0.0176528 0.0524945 -0.0276698 0.0234799 -0.0835052 0.0267084 -0.1318977 -0.0141143 -0.1425611 -0.0497341 -0.0805985 -0.116675 0.0067234 -0.1446411 0.0980462 -0.0586367 0.0131731 -0.0649483 0.1074043 0.095089 -0.0601076 -0.0155805 -0.0369936 0.0642743 -0.1488533 0.0136567 -0.1331418 -0.0177576 0.1952852 -0.1033912 -0.0096113 -0.1556932 0.19201 -0.0080813 -0.0099473 -0.0063964 0.3901299 unknown
polarizability: 110.8789577|1.2566929|70.9793338|-8.4123499|3.0252052|62.7910441 unknown
InChI: InChI=1S/C7H12O2/c1-2-3-4-5-6-7(8)9/h2,8H,1,3-6H2
charge 0 multiplicity 1
21 atoms
O  3.89177 -0.875891 0.061623
O  3.049552 1.287314 0.041157
C  -1.048158 -0.421875 -0.15011
C  0.302626 0.323531 -0.087185
C  -2.258707 0.548627 -0.192107
C  1.497026 -0.647947 -0.044577
C  -3.584105 -0.17386 -0.312822
C  2.838183 0.05559 0.021541
C  -4.617568 -0.07251 0.560728
H  0.329786 0.97995 0.803531
H  0.40413 0.993727 -0.962533
H  -1.073235 -1.074862 -1.047479
H  -1.153561 -1.09111 0.727413
H  -2.129573 1.229779 -1.060375
H  -2.258291 1.184885 0.714201
H  1.428443 -1.327478 0.827782
H  1.505368 -1.30903 -0.933655
H  -3.68986 -0.834087 -1.189219
H  -5.552156 -0.626123 0.415136
H  -4.557028 0.571103 1.4475
H  4.757459 -0.385532 0.10535
