program: Orca
programVersion: 5.0.4
elementType: C
charge: 0
multiplicity: 3
keywords: RIJCOSX PBEh-3c
formula: C
InChI: InChI=1/C
1 atoms
C  0.0010 0.0010 0.0010
totalener: -37.75397350 hartree
nucrepener: 0.00000000 hartree
electener: -37.75397350 hartree
oneelecener: -50.45515289 hartree
twoeener: 12.70117939 hartree
kineticenergy: 37.55564853 hartree
exchangeener: -2.803822510629 hartree
correlationener: -0.209850891027 hartree
xcener: -3.013673401656 hartree
s2: 2.002130
energy: -287.6204 -17.9777 -8.6448 -8.6448 -2.9444 13.5309 13.5309 14.5279 17.2476 45.9596 45.9596 46.2664 46.2665 46.5900 357.0163 electronvolt
energy: -286.7373 -14.0851 -1.8953 -0.4869 -0.4869 15.2715 16.3636 16.3636 19.0979 48.1154 48.5554 48.5555 49.8565 49.8565 358.2311 electronvolt
chargesum: -0.0000000
charge: -0.000000
dispersion: 0.000000000 hartree
energy: -37.753973499186 hartree
dipole: 0.00000 -0.00000 -0.00000 0.00000 -0.00001 -0.00001 0.00000 -0.00007 -0.00007
magnitude: 0.00007 au
magnitude: 0.00017 debye
