program: Orca
programVersion: 5.0.4
elementType: C
charge: 0
multiplicity: 3
keywords: SP B3LYP def2-QZVP def2-TZVP/C def2/J TightSCF
keywords: NoFrozenCore
formula: C
InChI: InChI=1/C
1 atoms
C  0.0000 0.0000 0.0000
totalener: -37.84021401 hartree
nucrepener: 0.00000000 hartree
electener: -37.84021401 hartree
oneelecener: -50.47511744 hartree
twoeener: 12.63490343 hartree
kineticenergy: 37.71434366 hartree
exchangeener: -4.001121722562 hartree
correlationener: -0.197036037062 hartree
xcener: -4.198157759624 hartree
s2: 2.003716
energy: -280.4468 -15.9626 -7.2398 -7.2398 -4.1848 3.7310 3.7310 4.0360 4.8496 12.7130 12.7130 12.7603 12.7603 12.9269 19.8764 19.8764 20.3552 39.1257 45.1253 45.1253 45.1988 45.1988 45.2181 45.2181 45.3034 48.7680 48.7680 48.9038 48.9038 49.2770 73.6662 73.6662 74.2269 129.1104 129.1104 129.1334 129.1334 129.2515 129.2516 129.2529 129.2529 129.3607 158.0257 158.0257 158.0624 158.0625 158.1145 158.1145 158.3454 158.3455 158.5905 158.5905 158.6449 159.1888 182.7556 721.6079 3958.0499 electronvolt
energy: -279.6486 -12.9766 -3.4080 -2.1782 -2.1782 4.1674 4.5717 4.5717 5.5334 13.3951 13.5713 13.5713 14.0916 14.0916 20.7598 21.6253 21.6253 40.7784 46.0272 46.1699 46.1699 46.5379 46.5379 47.1351 47.1351 50.3104 50.6604 50.6604 51.6818 51.6818 74.7270 75.9085 75.9085 130.4353 130.5517 130.5517 130.8638 130.8638 131.3623 131.3623 132.0527 132.0527 159.8963 160.1136 160.1136 160.2615 160.6499 160.6499 160.6972 160.6972 161.6528 161.6528 161.7837 161.7837 184.4932 723.0069 3958.4097 electronvolt
chargesum: -0.0000000
charge: -0.000000
energy: -37.840214009209 hartree
dipole: 0.00000 0.00000 0.00000 0.00000 0.00000 0.00000 0.00000 -0.00000 -0.00000
magnitude: 0.00000 au
magnitude: 0.00000 debye
