program: Gaussian 09
title: 000070698
version: EM64L-G09RevD.01
frameworkgroup: C1[X(C4H6N2)]
method: RPBEPBE
basis: SDD
operation: Freq
keyword: #p
keyword: freq=noraman
keyword: PBEPBE/SDD
title: #p freq=noraman PBEPBE/SDD
converged: YES YES NO NO
title: Mulliken charges:
elementType: N N C C C C H H H H H H
charge: -0.280594 -0.014758 0.116109 -0.474667 -0.729882 -0.130489 0.261849 0.289835 0.240584 0.228427 0.266620 0.226966
chargesum: 0.00000
title: Mulliken charges with hydrogens summed into heavy atoms:
elementType: N N C C C C
charge: -0.053628 -0.014758 0.116109 0.077017 0.005749 -0.130489
polarizability: 6.86236967e+01 -8.07359993e+00 4.95726377e+01 -1.21802627e+00 -1.22418034e-01 3.81101739e+01
1716.lowfreq: -9.5404 -0.9999 0.0004 0.0007 0.0010 8.4221 52.0265 129.5933 149.2497
frequency: 51.9815 129.5863 149.2466 354.5348 364.9525 439.8936 463.0237 571.0792 773.5686 833.2267 946.1393 956.4706 1011.6921 1054.3405 1084.3688 1188.4526 1284.6104 1317.4741 1390.2546 1432.4426 1454.2289 1459.2116 1640.3229 2200.4406 2979.0423 2988.3903 3064.4359 3077.2190 3097.2819 3305.9080
redmass: 2.8644 1.2331 3.9075 2.7924 3.8769 3.0695 3.3211 3.7977 2.7847 1.4918 1.6001 3.0884 1.7878 1.5571 1.4983 1.1404 1.3999 2.3643 1.2447 1.0811 1.0475 1.0785 6.2246 12.4272 1.0370 1.0636 1.0969 1.0946 1.1007 1.0759
irintensity: 8.1728 0.2494 6.0276 1.9072 0.1546 3.4887 17.7161 6.2275 7.1499 21.9027 22.4248 15.4142 1.2980 18.6351 89.9655 2.9315 6.0449 46.4136 45.5384 12.3003 27.2590 36.2343 65.9030 10.5161 5.7434 2.3873 9.2414 1.8116 18.7592 12.7652
temp: 298.150 k
press: 1.00000 atm
elementType: 7 7 6 6 6 6 1 1 1 1 1 1
symmnumber: 1
zpe: 245616.2 jmol-1
zpe.correction: 0.093550 hartree
zpe.thermalcorrener: 0.100346 hartree
zpe.thermalcorrenthalpy: 0.101290 hartree
zpe.thermalcorrgfe: 0.062506 hartree
zpe.sumelectzpe: -265.036552 hartree
zpe.sumelectthermal: -265.029756 hartree
zpe.sumelectthermalent: -265.028812 hartree
zpe.sumelectthermalfe: -265.067596 hartree
dipole: 2.9422 1.0912 1.7098
dipole: 3.5736
quadrupole: -44.7483 -36.4754 -35.1483
quadrupole: 6.9640 -2.7951 -1.1931
quadrupole: -5.9576 2.3152 3.6424 6.9640 -2.7951 -1.1931
hfenergy: -265.1301026 hartree
pointgroup: C01 [X(C4H6N2)]
dipole: -1.3205687 0.3316758 -0.3504446 debye
dipolederiv: -0.4370098 -0.2020215 -0.0919794 -0.3264625 -0.6592678 0.0844467 -0.0931574 0.0296145 -0.3443986 -0.3038412 -0.0078326 0.0200619 -0.0447594 -0.2470964 0.0080476 -0.0536209 -0.014757 -0.2181189 0.6577126 0.1439559 -0.2722484 0.1869109 0.6566114 0.0641532 -0.371662 0.0722878 0.1298378 -0.1342496 -0.0524098 0.0607363 -0.0890347 0.0588018 -0.0760314 0.106347 -0.0605877 0.0504759 -0.0442044 0.0010542 0.0629072 0.0216972 -0.319801 -0.1463719 0.1018025 -0.1479289 0.021072 0.1150006 0.0692343 0.0808946 0.1388548 0.026168 0.0345189 0.1619441 0.0611796 -0.0277296 0.041088 -0.029926 -0.0235484 -0.0221395 0.0743591 0.090843 -0.0284008 0.052843 0.0091789 0.0585801 0.0113179 -0.0126628 0.0461119 0.0123987 -0.0411971 -0.0160845 -0.0173758 0.1285969 0.1298989 0.0218891 0.0339949 -0.0110228 -0.0069466 0.0624581 -0.0077911 0.1187802 -0.0249596 -0.1005359 0.0129679 0.1034623 -0.0473484 0.0691967 0.014082 0.0928961 -0.0127476 0.0735919 0.0259787 -0.0212063 -0.1078398 -0.0174719 0.0781361 -0.0086578 -0.0863994 -0.0615556 0.0473613 -0.0084181 0.0529771 0.1462215 0.1646643 0.2574401 -0.0862913 0.1941265 -0.0197525 0.1550921 unknown
polarizability: 62.7521716|12.5523812|53.0533323|0.2017083|4.7105363|40.5010044 unknown
InChI: InChI=1S/C4H6N2/c1-4(6)2-3-5/h6H,2H2,1H3
charge 0 multiplicity 1
12 atoms
N  -1.770908 -1.265648 -0.037274
N  2.274694 0.967048 0.300922
C  -1.093423 -0.15258 -0.107773
C  0.217941 -0.217512 -0.912675
C  -1.469169 1.197428 0.479222
C  1.357768 0.437021 -0.248769
H  0.059497 0.270334 -1.896207
H  0.447324 -1.279693 -1.103765
H  -1.478921 1.977689 -0.305458
H  -2.461732 1.165853 0.959455
H  -0.722638 1.512889 1.232079
H  -2.667733 -1.156328 0.484143
