program: Orca
programVersion: 5.0.4
elementType: C
charge: 0
multiplicity: 3
keywords: SP DLPNO-CCSD(T) aug-cc-pV5Z aug-cc-pV5Z/C TightSCF
keywords: NoFrozenCore
formula: C
InChI: InChI=1/C
1 atoms
C  0.0000 0.0000 0.0000
totalener: -37.69368986 hartree
nucrepener: 0.00000000 hartree
electener: -37.69368986 hartree
oneelecener: -50.45056639 hartree
twoeener: 12.75687653 hartree
kineticenergy: 37.69352384 hartree
s2: 2.010448
energy: -308.7272 -22.5643 -11.9483 -11.9483 0.4417 1.7991 1.7991 2.0213 2.3036 5.7882 5.8010 5.8010 5.8555 5.8555 8.0107 8.0107 8.9907 11.6617 15.1663 15.1930 15.1930 15.2747 15.2747 15.4136 15.4136 17.9743 17.9743 18.1772 18.1772 18.2689 26.0087 26.0087 26.9754 42.5186 42.5521 42.5521 42.6533 42.6533 42.8231 42.8231 43.0618 43.0618 44.4463 44.4941 44.4941 44.6378 44.6378 44.8767 44.8767 45.0208 47.1101 47.1101 47.3734 47.3734 47.5170 73.7914 73.7914 74.1016 94.7732 94.8095 94.8095 94.9187 94.9187 95.1014 95.1014 95.3588 95.3588 95.6925 95.6925 110.7632 110.8239 110.8239 110.8397 110.9210 110.9210 111.0063 111.0063 111.1649 111.1649 111.3110 111.3110 111.5725 111.5725 111.7382 111.7382 122.5057 122.5609 122.5609 122.7393 122.7393 163.6419 231.2092 231.4529 231.4529 242.8004 242.8586 242.8586 243.0334 243.0334 243.3258 243.3258 243.7370 243.7370 244.2690 244.2690 273.4934 273.6089 273.6089 273.9565 273.9565 274.5403 274.5403 281.5695 281.6545 281.6545 281.9098 281.9098 282.3367 282.3367 282.9371 282.9371 324.8861 325.0593 325.0593 325.5877 325.5877 928.7052 electronvolt
energy: -307.5014 -15.8757 0.9034 1.3784 1.3784 2.2339 2.7152 3.6776 3.6776 5.8682 5.9201 5.9201 6.0890 6.0890 9.4282 10.2935 10.2935 12.5623 15.2549 15.2953 15.2953 15.4172 15.4172 15.6270 15.6270 18.8674 19.0479 19.0479 19.6563 19.6563 27.5082 28.6519 28.6519 42.6941 42.7408 42.7408 42.8818 42.8818 43.1199 43.1199 43.4605 43.4605 44.9110 45.0264 45.0264 45.3755 45.3755 45.9729 45.9729 46.6219 48.7010 49.0347 49.0347 50.1447 50.1447 74.6982 76.2246 76.2246 95.0108 95.0588 95.0588 95.2032 95.2032 95.4453 95.4453 95.7870 95.7870 96.2316 96.2316 111.2535 111.3487 111.3487 111.6359 111.6359 111.6906 111.8816 111.8816 112.1192 112.1192 112.4599 112.4599 112.8075 112.8075 113.4455 113.4455 123.7051 124.1294 124.1294 125.4742 125.4742 165.0259 231.6690 233.0572 233.0572 243.2727 243.3518 243.3518 243.5896 243.5896 243.9875 243.9875 244.5481 244.5481 245.2750 245.2750 274.3345 274.5491 274.5491 275.1972 275.1972 276.2941 276.2941 282.2516 282.3817 282.3817 282.7731 282.7731 283.4293 283.4293 284.3565 284.3565 325.6569 326.0532 326.0532 327.2738 327.2738 929.2199 electronvolt
chargesum: -0.0000000
charge: -0.000000
corrType: DLPNO BASED
energy: -37.819480457869 hartree
dipole: 0.00000 0.00000 0.00000 0.00000 0.00000 0.00000 0.00000 0.00000 0.00000
magnitude: 0.00000 au
magnitude: 0.00000 debye
