program: Orca
programVersion: 5.0.4
elementType: C
charge: 0
multiplicity: 3
keywords: SP F12/RI-CCSD(T) cc-pVTZ-F12 cc-pVTZ-F12-CABS cc-pVQZ/C VeryTightSCF
keywords: NoFrozenCore
formula: C
InChI: InChI=1/C
1 atoms
C  0.0000 0.0000 0.0000
totalener: -37.69333482 hartree
nucrepener: 0.00000000 hartree
electener: -37.69333482 hartree
oneelecener: -50.44952819 hartree
twoeener: 12.75619338 hartree
kineticenergy: 37.69265046 hartree
s2: 2.010239
energy: -308.7367 -22.5661 -11.9451 -11.9451 0.4633 2.2202 2.2688 2.2688 2.9148 11.3651 11.3651 12.6118 13.4146 19.0229 19.0229 19.4093 19.4093 19.5736 37.5005 37.5482 37.5482 37.6892 37.6892 37.9106 37.9106 42.1508 42.1508 43.0738 57.0519 66.5413 66.5413 66.8122 66.8122 66.9228 123.7717 123.8508 123.8508 124.0856 124.0856 124.4686 124.4686 141.3305 141.3749 141.3749 208.6976 208.8003 208.8003 209.1144 209.1144 555.7016 556.1468 556.1468 556.3298 electronvolt
energy: -307.5029 -15.8783 0.9838 1.5857 1.5857 2.4662 3.3597 4.3776 4.3776 13.1541 14.1903 14.1903 14.4719 20.4943 20.7360 20.7360 21.5588 21.5588 37.9888 38.1212 38.1212 38.4953 38.4953 39.1082 39.1082 43.7473 45.1660 45.1660 58.8427 68.4591 68.8706 68.8706 70.2187 70.2187 124.8126 125.0344 125.0344 125.6922 125.6922 126.7814 126.7814 141.9425 143.5430 143.5430 209.7712 210.2012 210.2012 211.5218 211.5218 556.0146 557.0866 557.0866 557.1955 electronvolt
corrType: UHF
chargesum: -0.0000000
charge: -0.000000
energy: -37.838914552717 hartree
dipole: 0.00000 -0.00000 -0.00000 0.00000 0.00000 0.00000 0.00000 -0.00000 -0.00000
magnitude: 0.00000 au
magnitude: 0.00000 debye
dipolemethod: MDCI
