program: Orca
programVersion: 5.0.4
elementType: C H H
charge: 0
multiplicity: 3
keywords: SP B2PLYP def2-QZVP def2-TZVP/C def2/J TightSCF
keywords: NoFrozenCore
formula: CH2
InChI: InChI=1/CH2/h1H2
3 atoms
C  -0.021382 -0.01544 0.055063
H  1.052971 -0.001411 0.005032
H  -0.79818 0.185395 -0.66117
totalener: -39.09086558 hartree
nucrepener: 6.17176838 hartree
electener: -45.26263396 hartree
oneelecener: -63.98607865 hartree
twoeener: 18.72344469 hartree
kineticenergy: 38.97910903 hartree
exchangeener: -2.752433760346 hartree
correlationener: -0.155779367923 hartree
xcener: -2.908213128269 hartree
s2: 2.008022
energy: -289.9714 -21.5549 -14.3207 -9.5735 -8.5109 1.8677 3.3182 4.5129 4.7066 5.0439 6.1807 10.7945 11.5129 12.5654 13.7518 13.8768 17.5870 18.4532 20.6944 21.1505 21.3008 22.3740 22.5390 23.4281 23.8297 29.8258 30.3936 33.2054 36.3300 46.8371 47.1090 47.2598 49.8534 50.6088 51.1082 51.5389 52.1015 53.6617 54.3685 55.2636 57.9132 62.8223 65.2039 65.6627 67.2474 68.3606 70.4803 71.0144 72.4423 73.8985 74.0464 75.1136 75.5674 89.0371 90.9454 95.0361 98.9470 99.4166 103.2269 104.1569 112.6961 132.0280 132.1822 138.8188 140.3250 141.8791 147.3976 150.4403 150.9617 155.4558 157.2132 158.0546 158.7112 160.8451 161.3083 165.1897 166.5618 166.6398 167.6291 169.8143 170.3239 175.5102 177.3338 180.3989 184.9169 185.2217 187.2146 196.5527 202.0147 205.5538 206.3753 206.6229 206.9468 206.9676 210.6019 210.9036 211.1836 222.5963 223.9228 224.7063 225.2126 226.5587 230.4225 237.5521 237.8797 238.3316 238.9257 267.8419 269.5376 274.9338 276.0658 280.9191 297.9047 314.5091 341.0330 781.8964 4035.1143 electronvolt
energy: -289.0122 -18.5586 -13.6757 -0.5054 0.1136 2.1002 3.4211 5.1372 5.5990 6.2190 6.8544 11.4562 12.2403 13.3064 15.2121 15.4039 17.7911 19.0185 21.0990 21.4976 22.9002 22.9297 23.9756 24.2022 24.3453 30.0589 30.5709 33.7583 36.6877 48.2244 48.4547 48.4998 50.9861 52.0846 52.8645 53.2163 53.6282 54.5988 55.3512 56.3645 58.6177 63.3372 65.6515 66.6047 67.8366 69.3596 70.8286 71.7178 72.8099 74.1966 75.2248 75.4666 76.3002 89.4770 91.1761 95.8726 99.6308 100.3949 103.9536 105.1759 113.1229 133.9432 134.1419 139.8317 141.3992 142.8786 148.2930 151.2961 152.0706 156.9484 158.4785 159.5724 159.8245 162.8868 164.0410 166.3979 167.3724 167.3843 168.2610 170.8778 171.2355 176.0173 178.5617 181.8964 185.6748 186.8021 188.6227 197.2918 202.3338 205.7567 206.6079 206.8787 207.2881 207.2924 210.7761 211.0959 211.4573 222.9499 223.9794 224.9473 225.2773 226.8645 230.7165 237.6444 237.9784 238.4618 239.1410 268.1281 269.8416 275.5033 276.6786 281.2554 298.2960 314.7271 341.6599 782.8706 4035.4625 electronvolt
chargesum: 0.0000000
charge: -0.192930 0.096503 0.096426
charge: 0.408463 -0.204185 -0.204278
qa: -0.1929 0.0965 0.0964
va: 3.8128 1.0090 1.0089
total: -39.138221723 hartree
energy: -39.138221722517 hartree
dipole: 0.23904 -0.15494 0.08410 0.17261 -0.11183 0.06078 -0.61557 0.39885 -0.21672
magnitude: 0.24028 au
magnitude: 0.61075 debye
