program: Gaussian 09
title: 000070689
version: EM64L-G09RevD.01
frameworkgroup: C1[X(C6H9N)]
method: RPBEPBE
basis: SDD
operation: Freq
keyword: #p
keyword: freq=noraman
keyword: PBEPBE/SDD
title: #p freq=noraman PBEPBE/SDD
converged: YES YES NO NO
title: Mulliken charges:
elementType: N C C C C C C H H H H H H H H H
charge: -0.168251 -0.035197 -0.034864 -0.034856 -0.591266 -0.591461 -0.591343 0.231236 0.231080 0.231114 0.219666 0.231617 0.219653 0.231578 0.219669 0.231625
chargesum: 0.00000
title: Mulliken charges with hydrogens summed into heavy atoms:
elementType: N C C C C C C
charge: -0.168251 0.196039 0.196216 0.196257 -0.139983 -0.140230 -0.140049
polarizability: 9.98156166e+01 -1.21798990e-02 9.97634447e+01 -3.52704933e-03 6.28340258e-03 3.57409641e+01
1716.lowfreq: -11.1534 -10.4524 0.0003 0.0005 0.0008 10.7839 126.6845 148.7043 152.2486
frequency: 126.6606 148.6949 152.2224 266.3857 268.8474 318.1397 417.0757 568.9897 570.0942 672.4913 672.8304 715.8004 753.6576 861.5549 862.9513 864.2377 963.7331 974.6463 975.4705 997.0877 998.0138 1088.4840 1253.4278 1254.1395 1294.8171 1343.6383 1344.2010 1424.8849 1427.2413 1428.2013 1637.5560 1638.9200 1639.3761 3118.0127 3119.2381 3119.6731 3137.1551 3137.5719 3140.4305 3230.3481 3231.8127 3232.1834
redmass: 3.1371 2.2906 2.2972 2.2842 2.2983 1.6297 3.1547 2.3258 2.3322 1.5103 1.5101 2.1569 2.0872 1.3446 1.3469 1.3370 1.1443 1.1621 1.1639 1.5528 1.5430 1.6933 2.4845 2.5106 1.2113 1.3964 1.3855 1.1840 1.2956 1.3021 4.5425 4.5671 4.5332 1.0603 1.0595 1.0594 1.0950 1.0951 1.0929 1.1149 1.1145 1.1145
irintensity: 0.1840 2.4142 2.4339 2.5922 2.5509 8.9151 1.0379 2.3589 2.2888 10.2352 10.4948 6.3696 0.7966 66.8608 72.5974 166.1583 41.1824 27.4272 27.2302 0.9220 1.0396 0.1731 65.3072 66.8725 0.3970 94.1358 92.6441 3.1272 9.2391 9.6352 19.8885 229.0996 237.9144 2.5461 4.8444 4.9654 7.6111 7.6199 2.7660 5.2535 21.7214 21.3881
temp: 298.150 k
press: 1.00000 atm
elementType: 7 6 6 6 6 6 6 1 1 1 1 1 1 1 1 1
symmnumber: 1
zpe: 349255.1 jmol-1
zpe.correction: 0.133024 hartree
zpe.thermalcorrener: 0.140741 hartree
zpe.thermalcorrenthalpy: 0.141685 hartree
zpe.thermalcorrgfe: 0.101470 hartree
zpe.sumelectzpe: -288.184076 hartree
zpe.sumelectthermal: -288.176359 hartree
zpe.sumelectthermalent: -288.175415 hartree
zpe.sumelectthermalfe: -288.215630 hartree
dipole: -0.0017 0.0002 -0.3578
dipole: 0.3578
quadrupole: -39.8455 -39.8343 -47.9912
quadrupole: -0.0016 0.0046 0.0036
quadrupole: 2.7115 2.7227 -5.4342 -0.0016 0.0046 0.0036
hfenergy: -288.3170999 hartree
pointgroup: C01 [X(C6H9N1)]
dipole: 0.0002456 -0.0006368 -0.1407528 debye
dipolederiv: -1.2359516 0.5150072 0.0000259 -0.5136183 -1.2354495 -0.0000431 -0.0003535 -0.0007815 -0.1399984 0.2614213 0.3843118 -0.1596572 0.6064741 1.1051215 -0.0185561 -0.2318654 0.0354814 0.0004064 0.4653923 -0.7248488 0.0631299 -0.5021661 0.9019767 0.1471498 0.1460606 0.1832207 0.0000005 1.3226986 0.0058209 0.0962795 0.2286063 0.0431645 -0.1284924 0.08591 -0.218364 0.000179 -0.4098148 -0.4306233 -0.1265267 -0.2030693 -0.2316141 0.1062847 -0.1104363 0.1628421 -0.4100111 -0.0010368 -0.0317668 0.1547626 0.1955913 -0.6399272 0.0564339 0.1956211 0.0138954 -0.4113346 -0.5501376 0.1222101 -0.0287677 0.3495355 -0.0905741 -0.16198 -0.0856845 -0.1762747 -0.410813 0.0058496 0.1253956 0.0842149 0.0129883 0.0179754 -0.0253645 0.0930285 0.0078873 0.1203838 -0.0449055 0.0160371 -0.0637706 -0.0960569 0.0688352 -0.0600604 -0.0393335 -0.0840533 0.1208271 0.0750704 0.0267548 -0.0201897 -0.085539 -0.0510117 0.0852044 -0.0533147 0.0765577 0.1206183 0.095909 -0.0254825 0.0385445 -0.0308244 -0.0847109 -0.0375257 0.037306 -0.0505727 0.1722447 0.0406384 0.067348 0.1011137 0.0777584 0.0227888 -0.0645655 0.0944714 -0.0547241 0.1637935 -0.0154963 0.0948957 -0.0515911 0.089549 0.0263528 -0.0146711 -0.0623295 -0.0070925 0.1726706 -0.0359143 -0.0342722 -0.1060192 -0.0237064 0.0989521 -0.0551854 -0.0942559 -0.0541569 0.1643733 -0.0640447 -0.06143 0.013092 -0.0667689 0.0750554 0.0519173 0.0249041 0.0573499 0.1724914 0.0903218 -0.0493576 0.0053593 -0.0387535 -0.0269348 0.1194541 0.0002717 0.1087853 0.1641685 unknown
polarizability: 99.7655058|-0.0158628|99.8135556|-0.0037608|-0.0061464|35.7409641 unknown
InChI: InChI=1S/C6H9N/c1-4-7(5-2)6-3/h4-6H,1-3H2
charge 0 multiplicity 1
16 atoms
N  0.000066 0.000298 -0.142109
C  -0.265242 -1.392455 -0.139154
C  -1.073561 0.92631 -0.138208
C  1.338988 0.466722 -0.137915
C  -1.425074 -1.98656 0.257386
C  -1.007856 2.228301 0.256712
C  2.432876 -0.242008 0.257846
H  0.565409 -1.990273 -0.531878
H  -2.007379 0.505209 -0.528528
H  1.442022 1.485634 -0.528812
H  -1.543145 -3.066453 0.139859
H  -2.252716 -1.436502 0.715165
H  -1.884594 2.869862 0.139956
H  -0.117009 2.671211 0.712074
H  3.427491 0.195173 0.141466
H  2.369324 -1.234668 0.71364
