program: Gaussian 09
title: 000004811
version: EM64L-G09RevD.01
frameworkgroup: C1[X(C15H21N3O2)]
method: RPBEPBE
basis: SDD
operation: Freq
keyword: #p
keyword: freq=noraman
keyword: PBEPBE/SDD
title: #p freq=noraman PBEPBE/SDD
converged: YES YES NO NO
title: Mulliken charges:
elementType: O O N N N C C C C C C C C C C C C C C C H H H H H H H H H H H H H H H H H H H H H
charge: -0.346546 -0.273260 -0.065613 -0.145597 -0.376158 0.189796 -0.223377 -0.480147 0.309593 -0.412001 0.261084 -0.787686 -0.637258 -0.529340 -0.652156 -0.363592 0.368760 -0.407427 0.272831 -0.605946 0.222271 0.247780 0.222267 0.180987 0.235408 0.222076 0.215824 0.230532 0.228130 0.228958 0.195290 0.272134 0.239247 0.214714 0.224362 0.226200 0.243493 0.328738 0.227992 0.226663 0.270972
chargesum: 0.00000
title: Mulliken charges with hydrogens summed into heavy atoms:
elementType: O O N N N C C C C C C C C C C C C C C C
charge: -0.346546 -0.273260 -0.065613 -0.145597 -0.047420 0.189796 -0.001107 -0.010100 0.309593 0.004394 0.261084 -0.119254 0.015120 -0.257206 0.026169 -0.137392 0.368760 -0.163934 0.272831 0.119681
polarizability: 2.80903218e+02 3.36132774e-01 1.84560919e+02 -2.65632508e+00 -3.81310876e+00 1.22055908e+02
1716.lowfreq: -19.6059 -7.4163 -0.0003 0.0004 0.0009 3.4465 6.1756 18.2528 39.4060
frequency: -12.9297 17.4722 39.3476 57.1018 73.6999 99.6257 104.7579 116.5899 124.0800 148.0719 167.3859 188.4777 192.2383 224.3997 228.4846 240.1994 254.7055 277.0413 302.0393 308.2839 332.5803 355.5101 364.6097 381.2100 444.8309 468.7530 514.2172 539.8391 575.1589 580.0848 592.1979 606.3411 640.9008 677.8161 688.3333 723.1561 743.8024 762.0159 794.6099 807.2110 835.0947 867.6353 883.2920 898.4946 916.9579 921.0197 925.8013 962.7759 984.9919 1016.6373 1037.1943 1052.9636 1084.9737 1099.7482 1105.3867 1109.7666 1117.8733 1126.3884 1127.6620 1138.5263 1143.8903 1156.6766 1176.5660 1177.3343 1194.1032 1201.5451 1211.3505 1226.9771 1248.8989 1275.8947 1293.6063 1309.2603 1333.0978 1345.2881 1363.2574 1386.7983 1404.5740 1429.3622 1433.3497 1435.8350 1442.6427 1457.9469 1460.3684 1464.6271 1470.5757 1471.5314 1475.4066 1476.7435 1484.1909 1488.2711 1498.2394 1511.6760 1517.7855 1598.9985 1629.7740 1684.5866 2856.0777 2857.0025 2870.1890 2940.7658 2974.2974 2976.9366 3010.0556 3013.7966 3023.0794 3027.6008 3053.2523 3066.6349 3069.6857 3078.1284 3079.1087 3089.1663 3110.3003 3139.6973 3164.5949 3174.9705 3578.2014
redmass: 3.3436 4.8128 4.1676 4.1470 2.9636 2.5891 1.1458 1.4057 2.9465 3.0814 1.9222 1.4731 3.6909 3.8644 1.1779 1.9994 2.3783 3.4846 3.0409 2.8232 3.4324 4.7169 4.3036 5.3750 3.3831 3.3265 3.4155 5.6845 1.6954 1.8116 3.4287 4.4233 4.9043 5.4025 11.0991 3.8521 3.9247 3.5095 1.5809 2.6422 5.0184 2.7114 1.6460 2.6630 1.8808 1.4293 2.2418 2.2389 2.2021 1.8258 2.0647 2.3765 4.4451 1.3783 1.5805 1.4640 1.7756 1.2848 1.9499 1.8257 1.7078 1.6168 2.5206 2.1079 2.0144 2.1672 3.5118 1.8152 2.6489 1.4658 1.8119 1.7324 1.3696 1.4230 5.0886 1.2061 2.9799 1.1656 1.2774 1.2777 2.5508 1.0892 1.4262 1.0629 1.0563 1.0621 1.0911 1.0604 1.0445 1.2362 1.0872 1.5503 2.1604 7.6669 7.3387 9.2999 1.0766 1.0629 1.0719 1.0378 1.0356 1.0354 1.0978 1.0758 1.0730 1.0732 1.1026 1.0991 1.0971 1.1002 1.1002 1.1050 1.0979 1.0880 1.0960 1.0927 1.0772
irintensity: 0.0023 1.5436 9.1169 3.0994 1.0254 0.6325 0.0619 0.4770 2.9521 1.6430 0.8776 1.8558 0.3233 1.8278 0.7538 1.9432 0.5772 1.9769 7.7744 7.6131 3.7954 14.8023 1.9447 0.9195 4.6684 5.4481 3.0799 1.2793 52.1647 88.2537 9.5588 0.8654 2.4784 2.5468 24.1475 5.6027 4.0149 1.6704 50.3622 17.1304 11.8159 15.2976 8.7552 36.4315 15.2603 4.3604 35.3634 7.8110 64.3666 20.7274 87.6788 20.6386 213.6629 19.0551 1.6035 12.7370 86.9077 1.3409 91.2706 27.2529 86.0115 109.0372 116.3325 163.7651 97.9234 97.9060 21.8595 14.7386 17.1481 47.7054 9.1870 0.6050 14.2916 15.3509 8.0517 14.3819 5.4841 30.2012 117.6313 41.7066 105.0568 6.7670 157.3760 11.6916 19.3620 1.8851 1.0924 15.8015 14.3581 48.3942 5.9625 336.6087 18.9627 26.1697 55.2620 251.2419 57.0521 29.7540 256.8730 131.2329 35.0772 102.1159 41.5455 19.4234 49.5208 47.6290 39.8118 30.3983 34.4968 10.2891 32.0241 30.2228 4.2867 17.6433 12.6637 0.6589 43.1176
temp: 298.150 k
press: 1.00000 atm
elementType: 8 8 7 7 7 6 6 6 6 6 6 6 6 6 6 6 6 6 6 6 1 1 1 1 1 1 1 1 1 1 1 1 1 1 1 1 1 1 1 1 1
symmnumber: 1
zpe: 891247.4 jmol-1
zpe.correction: 0.339458 hartree
zpe.thermalcorrener: 0.359141 hartree
zpe.thermalcorrenthalpy: 0.360085 hartree
zpe.thermalcorrgfe: 0.290700 hartree
zpe.sumelectzpe: -897.390000 hartree
zpe.sumelectthermal: -897.370317 hartree
zpe.sumelectthermalent: -897.369373 hartree
zpe.sumelectthermalfe: -897.438758 hartree
dipole: 0.7851 0.5901 1.2660
dipole: 1.6023
quadrupole: -83.4571 -113.0682 -123.1136
quadrupole: -2.6459 -1.3952 -2.9497
quadrupole: 23.0892 -6.5219 -16.5673 -2.6459 -1.3952 -2.9497
hfenergy: -897.7294581 hartree
pointgroup: C01 [X(C15H21N3O2)]
dipole: -0.314444 0.3040892 -0.453903 debye
polarizability: 280.2682164|-3.9087185|182.9289618|-8.5731482|11.4761873|124.3228666 unknown
InChI: InChI=1S/C15H21N3O2/c1-15-7-8-17(3)13(15)18(4)12-6-5-10(9-11(12)15)20-14(19)16-2/h5-6,9,13,16H,7-8H2,1-4H3
charge 0 multiplicity 1
41 atoms
O  3.303499 0.707647 -0.240357
O  3.431701 -1.579907 0.428718
N  -3.699619 -0.584037 0.723303
N  -2.25816 1.392294 0.177065
N  5.311065 -0.319907 -0.212602
C  -1.593315 -0.832833 -0.524238
C  -2.840636 0.104397 -0.273935
C  -1.725244 -1.901411 0.619544
C  -0.399103 0.089058 -0.297978
C  -3.239456 -1.988955 0.875168
C  -0.862162 1.350801 0.182272
C  -1.625275 -1.488543 -1.922265
C  -5.15308 -0.424938 0.5604
C  0.96693 -0.180604 -0.435698
C  -3.085511 2.487248 0.654966
C  0.063385 2.353713 0.560564
C  1.885985 0.834835 -0.064639
C  1.44616 2.079149 0.428116
C  3.970552 -0.516279 0.036422
C  6.298781 -1.385528 -0.037113
H  -3.425837 0.291483 -1.20784
H  -1.209726 -1.540218 1.525768
H  -1.281678 -2.869506 0.329748
H  -3.729748 -2.669097 0.133705
H  -3.478914 -2.369735 1.885447
H  -0.732896 -2.122067 -2.076714
H  -2.520144 -2.127856 -2.042178
H  -1.638972 -0.722918 -2.718688
H  -5.425662 0.644192 0.533055
H  -5.672801 -0.877821 1.424045
H  -5.549603 -0.907706 -0.368352
H  1.326227 -1.150446 -0.78769
H  -3.440468 2.328194 1.694354
H  -3.974206 2.604818 0.003545
H  -2.521411 3.435737 0.620707
H  -0.262845 3.321999 0.952846
H  2.192285 2.83059 0.705265
H  5.596017 0.610295 -0.51907
H  7.050551 -1.11679 0.728296
H  6.819586 -1.612933 -0.986038
H  5.765048 -2.289217 0.297676
