program: Gaussian 09
title: 000070684
version: EM64L-G09RevD.01
frameworkgroup: C1[X(C3H3BrO3)]
method: RPBEPBE
basis: SDD
operation: Freq
keyword: #p
keyword: freq=noraman
keyword: PBEPBE/SDD
title: #p freq=noraman PBEPBE/SDD
converged: YES YES NO NO
title: Mulliken charges:
elementType: Br O O O C C C H H H
charge: 0.050883 -0.363883 -0.101749 -0.204535 -0.751595 0.208959 0.139809 0.314016 0.314367 0.393730
chargesum: 0.00000
title: Mulliken charges with hydrogens summed into heavy atoms:
elementType: Br O O O C C C
charge: 0.050883 0.029847 -0.101749 -0.204535 -0.123213 0.208959 0.139809
polarizability: 7.93289645e+01 -4.72222056e+00 5.44499524e+01 -2.60121675e-02 -4.36121733e-02 2.55946289e+01
1716.lowfreq: -13.7626 -3.1446 -0.0003 0.0004 0.0007 2.5908 30.5391 41.7122 140.7035
frequency: 30.1374 41.5750 140.7032 201.5807 325.8237 357.0772 474.2653 586.8742 598.0502 663.7806 681.7447 762.8968 868.1946 990.2455 1086.5039 1114.8949 1241.7455 1316.2630 1396.3262 1616.7796 1662.6527 3042.1888 3110.6084 3506.3193
redmass: 5.6200 3.9113 9.8164 18.6911 9.6286 3.1987 10.8941 4.8060 1.4153 2.1172 5.5058 6.8054 2.1474 3.9608 2.1519 1.1458 1.4180 2.6528 1.0932 10.7956 10.9822 1.0580 1.1041 1.0644
irintensity: 9.4003 0.7091 0.6984 3.7135 1.9996 2.8117 11.0071 122.7277 66.2153 118.6623 12.2716 1.3601 7.6437 189.1648 74.0608 1.1541 9.7141 17.0341 42.4719 185.1370 92.0473 14.0220 0.0539 48.6870
temp: 298.150 k
press: 1.00000 atm
elementType: 35 8 8 8 6 6 6 1 1 1
symmnumber: 1
zpe: 154421.3 jmol-1
zpe.correction: 0.058816 hartree
zpe.thermalcorrener: 0.066436 hartree
zpe.thermalcorrenthalpy: 0.067380 hartree
zpe.thermalcorrgfe: 0.023711 hartree
zpe.sumelectzpe: -354.694475 hartree
zpe.sumelectthermal: -354.686855 hartree
zpe.sumelectthermalent: -354.685911 hartree
zpe.sumelectthermalfe: -354.729580 hartree
dipole: 2.3721 -1.8461 -0.0207
dipole: 3.0059
quadrupole: -39.5419 -57.6527 -47.4750
quadrupole: 1.4106 -0.0733 -0.0033
quadrupole: 8.6813 -9.4295 0.7482 1.4106 -0.0733 -0.0033
hfenergy: -354.7532909 hartree
pointgroup: C01 [X(C3H3Br1O3)]
dipole: -0.9730497 -0.6720375 0.0085972 debye
dipolederiv: -0.3684609 0.0152279 -0.0008811 -0.0725641 -0.0449965 -0.0004597 -0.0015437 0.0002536 -0.0784199 -0.9127369 0.5727531 0.0048044 0.4812996 -0.6683141 -0.0038926 0.0062209 -0.0046233 -0.3924805 -0.4208678 -0.0501842 0.0004606 0.1173859 -0.6730444 0.0040918 0.000013 0.0040766 -0.241659 -0.6763529 -0.1726459 0.0003901 0.1849867 -0.8702584 -0.0041389 0.0025338 -0.0020992 -0.2990294 0.4439201 0.2150114 0.0018359 0.5229764 -0.2958648 0.0024412 0.0041303 -0.0000397 0.0525321 0.733616 -0.0800541 -0.0008332 -0.5711344 0.8544291 -0.007936 -0.0007093 -0.0057977 0.1827338 1.0407083 -0.2786039 -0.00534 -0.4358467 1.255981 0.0102126 -0.0087571 0.0081102 0.2510234 -0.0401633 -0.0534567 0.0588833 -0.046665 0.1034165 0.0502902 0.0313606 0.0465275 0.0569395 -0.0388614 -0.052648 -0.0594172 -0.0459716 0.1037204 -0.050287 -0.0332181 -0.046028 0.0570626 0.2391989 -0.1153996 0.0000972 -0.1344668 0.2349312 -0.0003217 -0.0000305 -0.0003799 0.4112975 unknown
polarizability: 79.7847507|3.2790237|53.9942352|0.0241161|-0.0125247|25.5945599 unknown
InChI: InChI=1S/C3H3BrO3/c4-1-2(5)3(6)7/h6H,1H2
charge 0 multiplicity 1
10 atoms
Br 3.131412 -0.209848 0.007279
O  -2.146805 0.842535 0.010615
O  0.504171 1.544998 -0.015643
O  -1.529126 -1.404661 -0.004404
C  1.23474 -0.82027 0.000871
C  0.233703 0.331041 -0.005192
C  -1.230237 -0.187862 0.000363
H  1.086145 -1.4529 0.891714
H  1.093458 -1.454102 -0.890499
H  -3.074861 0.47917 0.012896
