program: Orca
programVersion: 5.0.4
elementType: C H H
charge: 0
multiplicity: 3
keywords: SP M062X 6-311++G(2d,2p) def2-TZVP/C def2/J TightSCF
formula: CH2
InChI: InChI=1/CH2/h1H2
3 atoms
C  -0.021382 -0.01544 0.055063
H  1.052971 -0.001411 0.005032
H  -0.79818 0.185395 -0.66117
totalener: -39.14330089 hartree
nucrepener: 6.17176835 hartree
electener: -45.31506924 hartree
oneelecener: -63.97558572 hartree
twoeener: 18.66051648 hartree
kineticenergy: 39.00724263 hartree
xcener: -2.906783011603 hartree
s2: 2.006067
energy: -287.6969 -20.9012 -14.3012 -9.3880 -8.2871 0.1396 0.7929 2.2028 2.3797 3.3857 3.8553 4.7024 6.0675 12.3017 13.6158 15.3135 15.4708 15.6340 16.9407 17.6932 18.0561 18.9842 23.2332 25.7979 27.3391 31.3983 31.6428 35.4270 39.5444 42.1230 67.7746 68.6458 74.3659 78.5458 83.4552 85.4975 85.5273 86.3197 86.6640 98.4160 104.9085 105.8891 106.5135 107.5344 127.0979 128.3944 649.7317 electronvolt
energy: -287.1995 -18.5061 -13.7169 -1.7706 -1.0553 0.5232 1.2057 2.6235 3.3104 3.8421 3.9605 5.3349 6.2681 12.9580 13.5666 14.8935 15.1525 16.5774 17.8686 18.0840 18.3889 19.0733 23.0219 25.3864 26.6704 30.8218 31.0525 34.7563 41.4447 43.6119 70.0704 71.0513 76.0577 79.4231 90.3317 90.3504 90.6514 91.2425 91.7833 100.0052 110.0477 111.2267 112.0056 112.0975 140.5409 143.4926 650.5784 electronvolt
chargesum: -0.0000000
charge: -0.310996 0.155351 0.155645
charge: 0.188258 -0.094063 -0.094194
qa: -0.3110 0.1554 0.1556
va: 3.8046 0.9763 0.9764
energy: -39.143300887026 hartree
dipole: 0.23904 -0.15343 0.08561 0.17261 -0.11074 0.06187 -0.61557 0.39565 -0.21992
magnitude: 0.24398 au
magnitude: 0.62014 debye
