program: Orca
programVersion: 6.0.0
elementType: C H H
charge: 0
multiplicity: 3
keywords: Opt RIJCOSX PBEh-3c
formula: CH2
InChI: InChI=1/CH2/h1H2
3 atoms
C  -6.567656 2.612395 0.029011
H  -5.493331 2.626389 -0.020895
H  -7.344573 2.813206 -0.687136
totalener: -39.06289836454773 hartree
nucrepener: 6.17793458988132 hartree
electener: -45.24083295442904 hartree
oneelecener: -63.97943445826999 hartree
twoeener: 18.73860150384095 hartree
kineticenergy: 38.80593814845309 hartree
exchangeener: -3.248503651612 hartree
correlationener: -0.294779530962 hartree
xcener: -3.543283182574 hartree
s2: 2.007960
dispersion: -0.000282707 hartree
s2: 2.007713
dispersion: -0.000282780 hartree
s2: 2.007121
dispersion: -0.000282973 hartree
s2: 2.007085
dispersion: -0.000282984 hartree
s2: 2.007084
energy: -285.1867 -20.8436 -13.9874 -9.1851 -8.1608 4.2178 6.6538 13.7303 13.8495 14.0088 17.9300 27.2842 29.4185 45.7222 46.2370 46.3126 electronvolt
energy: -284.2816 -18.1139 -13.2994 -0.7537 -0.0185 4.9843 7.4794 14.5663 16.0943 17.0687 19.7213 28.5095 30.2167 48.1021 electronvolt
chargesum: -0.0000000
charge: -0.441086 0.220539 0.220546
charge: -0.266027 0.133016 0.133011
qa: -0.4411 0.2205 0.2205
va: 3.7742 0.9262 0.9262
energy: -39.063026017501 hartree
dipole: 0.238919440 -0.144094233 0.094825207 0.172560723 -0.104063497 0.068497226 -0.615400117 0.371114691 -0.244285425
dipolemethod: SCF
magnitude: 0.270848775 au
magnitude: 0.688442875 debye
