program: Orca
programVersion: 6.0.0
elementType: C H H
charge: 0
multiplicity: 3
keywords: Freq RIJCOSX PBEh-3c
frequency: 0.00 0.00 0.00 0.00 0.00 0.00 1114.07 3247.11 3475.59
frequency: 1114.07 3247.11 3475.59
formula: CH2
InChI: InChI=1/CH2/h1H2
3 atoms
C  -6.567656 2.612395 0.029011
H  -5.493331 2.626389 -0.020895
H  -7.344573 2.813206 -0.687136
totalener: -39.06330438362384 hartree
nucrepener: 6.17178504783665 hartree
electener: -45.23508943146048 hartree
oneelecener: -63.96569371729669 hartree
twoeener: 18.73060428583620 hartree
kineticenergy: 38.80593262952077 hartree
exchangeener: -3.248741451707 hartree
correlationener: -0.294543113411 hartree
xcener: -3.543284565118 hartree
s2: 2.007088
energy: -285.1870 -20.8437 -13.9875 -9.1851 -8.1608 4.2179 6.6538 13.7302 13.8493 14.0088 17.9300 27.2841 29.4185 45.7220 46.2369 46.3125 electronvolt
energy: -284.2818 -18.1139 -13.2995 -0.7538 -0.0186 4.9842 7.4793 14.5663 16.0942 17.0687 19.7212 28.5094 30.2166 48.1021 electronvolt
chargesum: 0.0000000
charge: -0.441078 0.220536 0.220543
charge: -0.266023 0.133013 0.133009
qa: -0.4411 0.2205 0.2205
va: 3.7742 0.9262 0.9262
dispersion: -0.000282984 hartree
energy: -39.063026011967 hartree
dipole: 0.238919438 -0.144096714 0.094822723 0.172560716 -0.104064891 0.068495825 -0.615400117 0.371119677 -0.244280440
dipolemethod: SCF
magnitude: 0.270843054 au
magnitude: 0.688428334 debye
temp: 298.15 k
press: 1.00 atm
zeropoint: 0.01785347 hartree
thermalvibcorrection: 0.00002360 hartree
thermalrotcorrection: 0.00141627 hartree
thermaltrasncorrection: 0.00141627 hartree
thermaltotal: -39.04231640 hartree
thermalcorr: 0.00285614 hartree
nonthermalcorr: 0.01785347 hartree
totalcorr: 0.02070961 hartree
thermalcorrenthalpy: 0.00094421 hartree
totalenthalpy: -39.04137219 hartree
vibrat: 0.00002798 hartree
rotat: 0.00501361 hartree
transl: 0.01608942 hartree
total: 0.02216831 hartree
totalentropycorr: -0.02216831 hartree
gibbsenthalpy: -39.06354050 hartree
gibbsminuselec: -0.00051449 hartree
