program: Orca
programVersion: 6.0.0
elementType: C H H
charge: 0
multiplicity: 3
keywords: SP revDSD-PBEP86-D4/2021 def2-QZVP def2-TZVP/C def2/J TightSCF
keywords: NoFrozenCore
formula: CH2
InChI: InChI=1/CH2/h1H2
3 atoms
C  -0.021372 -0.015436 0.055048
H  1.052954 -0.001442 0.005142
H  -0.798289 0.185375 -0.661099
totalener: -39.02465401417764 hartree
nucrepener: 6.17178507103771 hartree
electener: -45.19642406495691 hartree
oneelecener: -63.96250333246319 hartree
twoeener: 18.76607926750627 hartree
kineticenergy: 38.93523925572071 hartree
exchangeener: -1.803196990246 hartree
correlationener: -0.100200754507 hartree
xcener: -1.903397744753 hartree
s2: 2.011598
energy: -295.4234 -23.1187 -15.2211 -10.6167 -9.5267 2.3569 3.8189 4.9113 5.1014 5.4522 6.7860 11.5075 12.2749 13.2656 14.3840 14.5003 electronvolt
energy: -294.3197 -19.4374 -14.4704 0.6359 1.1824 2.7104 4.0197 5.7200 6.4359 7.1982 7.6911 12.3349 13.2086 14.2590 electronvolt
chargesum: 0.0000000
charge: -0.229629 0.114833 0.114796
charge: 0.409223 -0.204593 -0.204630
qa: -0.2296 0.1148 0.1148
va: 3.8302 1.0014 1.0012
total: -39.103461552 hartree
dispersion: -0.000265467 hartree
energy: -39.103727018464 hartree
dipole: 0.238919430 -0.156121230 0.082798200 0.172560732 -0.112713864 0.059846867 -0.615400117 0.402000490 -0.213399627
dipolemethod: SCF
magnitude: 0.236593724 au
magnitude: 0.601373454 debye
