program: Gaussian 09
title: 000070642
version: EM64L-G09RevD.01
frameworkgroup: C1[X(C10H11NO)]
method: RPBEPBE
basis: SDD
operation: Freq
keyword: #p
keyword: freq=noraman
keyword: PBEPBE/SDD
title: #p freq=noraman PBEPBE/SDD
converged: NO NO NO NO
title: Mulliken charges:
elementType: O N C C C C C C C C C C H H H H H H H H H H H
charge: -0.273188 -0.460463 0.314140 0.201954 0.368709 -0.538059 -0.563307 -0.333176 0.316822 -0.347238 -0.811268 -0.537273 0.254447 0.298550 0.249226 0.227537 0.245312 0.232188 0.249716 0.232132 0.239946 0.216651 0.216644
chargesum: 0.00000
title: Mulliken charges with hydrogens summed into heavy atoms:
elementType: O N C C C C C C C C C C
charge: -0.273188 -0.161912 0.314140 0.201954 0.368709 -0.283612 -0.314081 -0.105640 0.316822 -0.101925 -0.097233 0.135967
polarizability: 1.86368973e+02 -3.64957765e+00 1.18864517e+02 6.17962226e-03 -3.69935833e-03 5.82869206e+01
1716.lowfreq: -3.6701 -0.0008 -0.0005 -0.0004 1.9545 13.5791 77.4561 106.7589 116.3517
frequency: 77.1736 106.7326 116.3413 174.6136 194.4838 244.8738 264.3052 286.9174 378.6787 390.6829 428.6872 434.5340 488.6880 507.1927 565.4237 607.6969 630.7888 659.2955 738.9715 744.8748 793.2471 798.7367 828.6107 855.4631 925.2006 930.1297 972.0502 989.9808 1001.6942 1044.2591 1114.9959 1115.5863 1142.5560 1156.4603 1186.1582 1225.7485 1235.7137 1304.0565 1312.6219 1380.2919 1402.4376 1419.9646 1437.6209 1463.7844 1467.2175 1467.6065 1475.5913 1480.0608 1481.6735 1565.7987 1601.5008 1634.3363 2945.2535 2964.7463 3026.1479 3033.6385 3097.1936 3113.7826 3132.6622 3155.0603 3168.7839 3212.2073 3604.4688
redmass: 2.8468 1.6567 1.7359 3.2435 3.3666 1.3470 3.0416 2.6361 5.4113 4.5693 2.7384 4.2324 1.2536 3.6760 5.4480 2.9485 3.0765 5.2518 5.8164 3.0545 1.2641 1.5943 3.9420 1.7094 3.6760 1.3280 2.5685 2.0389 4.2507 1.4717 1.2634 1.4411 1.3580 1.3782 2.5831 2.7545 1.3587 2.0878 2.9021 4.5239 1.3739 2.1264 1.3946 1.0501 1.0439 2.6342 1.4158 2.2831 1.2842 5.7080 5.6485 7.2507 1.0336 1.0392 1.1030 1.0979 1.0956 1.0984 1.0893 1.0909 1.0953 1.0979 1.0803
irintensity: 9.4857 0.5233 0.0360 2.9405 4.1756 0.0008 3.4940 0.2420 0.5924 2.1870 1.7739 3.3239 77.0436 1.7378 4.3833 27.1811 2.4434 2.6342 13.9733 5.3831 41.1424 30.0427 1.0527 62.4607 8.7652 0.1191 1.9791 7.2238 30.1323 6.7836 0.2313 8.2804 21.2544 1.6452 191.8979 18.6356 6.6462 12.5348 3.6367 47.5567 8.7139 59.1779 14.6332 12.2363 15.2870 57.5510 12.7373 93.4053 0.9755 2.4289 46.2062 39.5049 69.9958 65.4896 58.0020 24.5445 14.1186 31.8607 12.8233 10.9049 8.4376 6.0990 45.7929
temp: 298.150 k
press: 1.00000 atm
elementType: 8 7 6 6 6 6 6 6 6 6 6 6 1 1 1 1 1 1 1 1 1 1 1
symmnumber: 1
zpe: 488710.7 jmol-1
zpe.correction: 0.186140 hartree
zpe.thermalcorrener: 0.196976 hartree
zpe.thermalcorrenthalpy: 0.197920 hartree
zpe.thermalcorrgfe: 0.149923 hartree
zpe.sumelectzpe: -516.769062 hartree
zpe.sumelectthermal: -516.758226 hartree
zpe.sumelectthermalent: -516.757282 hartree
zpe.sumelectthermalfe: -516.805279 hartree
dipole: 2.5070 -0.4725 0.0011
dipole: 2.5511
quadrupole: -56.9588 -60.5287 -76.0417
quadrupole: 9.7721 -0.0031 -0.0009
quadrupole: 7.5509 3.9810 -11.5320 9.7721 -0.0031 -0.0009
hfenergy: -516.9552019 hartree
pointgroup: C01 [X(C10H11N1O1)]
dipole: -0.9918715 -0.1536144 -0.0004271 debye
dipolederiv: -1.5606949 0.4471709 0.000054 0.524724 -0.5373687 -0.0000288 -0.0001126 -0.0000739 -0.3025652 -0.6127865 -0.0460939 -0.0000018 0.1790104 -0.5217892 0.0000253 -0.0001207 0.0000651 -0.2747227 0.2957832 -0.0247476 0.0000143 0.4388025 0.0365478 0.0000125 -0.0000102 -0.0000009 0.0360154 0.3764485 -0.0507404 -0.0000122 -0.4769204 -0.2467465 -0.0000371 -0.000031 -0.0000293 -0.0002522 0.2491001 -0.0020082 0.0000639 -0.1983967 0.588025 -0.0000341 0.0004603 0.0000219 -0.0335217 -0.4021252 0.1302943 -0.0000049 0.02362 -0.0526367 0.000021 -0.0000095 0.0000019 -0.3081615 -0.2825198 0.1076617 0.0000114 -0.1958567 0.0065447 0.0000177 -0.0000502 0.0000201 -0.2445925 0.2602963 0.172137 0.0000462 0.087098 0.1361612 0.000007 0.0000302 0.0000146 -0.179238 1.4271943 -0.3870446 -0.0000078 -0.3790717 0.0938379 -0.0000928 0.0001924 -0.000067 0.0801324 -0.3899342 -0.059622 -0.0000044 0.2865704 -0.0079759 0.0000184 0.000045 -0.0000033 -0.2056768 -0.0265015 -0.073726 0.0000141 0.0449171 0.0407496 0.0000645 -0.0003868 -0.0000015 0.1143123 0.4196466 -0.1270162 -0.0000319 -0.5299554 0.5674319 0.0000286 -0.0001287 0.0000562 0.3408702 0.068567 -0.0281282 0.0000015 -0.0630669 -0.0627344 -0.00001 0.0000024 -0.0000022 0.1961497 0.1739673 -0.0105901 0.0000001 -0.0120674 0.1659443 -0.0000098 0.0000392 -0.0000458 0.3283536 0.0714773 0.0409756 -0.0000065 0.0857935 -0.0742298 -0.000005 -0.0000183 -0.0000035 0.1741545 0.0580825 0.0788554 -0.0000012 0.0386962 -0.1091332 -0.0000055 -0.0000115 -0.0000047 0.1716484 0.0030533 -0.0958799 -0.0000093 -0.0855068 0.0188897 -0.000004 0.0000039 0.0000006 0.1732123 -0.0839958 0.0066505 -0.0584694 0.0596215 0.0589077 0.0969693 -0.1476296 0.0718732 -0.051738 0.0735288 0.0109787 -0.000016 -0.0972329 -0.1096433 0.0001827 0.0000993 0.0001773 0.1214956 -0.0838768 0.0067909 0.0584181 0.059935 0.0585952 -0.0971946 0.1475649 -0.0720715 -0.0513826 -0.1901605 0.0425372 0.0000685 0.0013935 0.0812889 0.0000008 0.0000648 -0.0000035 0.1198159 0.0777115 -0.0692248 -0.0962103 0.103925 -0.0652428 -0.0873689 -0.0248835 -0.1096168 -0.1021897 0.0777384 -0.0692304 0.0960838 0.1039679 -0.0654235 0.0874429 0.0248902 0.1096929 -0.1021196 unknown
polarizability: 186.5351485|1.4402107|118.698341|0.006297|0.0034957|58.2869206 unknown
InChI: InChI=1S/C10H11NO/c1-7-5-8-6-9(12-2)3-4-10(8)11-7/h3-6,11H,1-2H3
charge 0 multiplicity 1
23 atoms
O  3.323523 -0.086667 0.000484
N  -2.176613 0.909587 0.000176
C  -0.408692 -0.541131 0.000212
C  -0.773865 0.850632 0.000247
C  -2.706163 -0.393511 0.00012
C  -1.642129 -1.300542 0.000146
C  0.966503 -0.904972 0.000289
C  0.195691 1.877368 0.00033
C  1.929583 0.125658 0.000373
C  1.550529 1.503203 0.000388
C  -4.189773 -0.631793 -0.000099
C  3.787544 -1.46852 -0.000155
H  -1.743573 -2.384851 0.000113
H  -2.72962 1.764034 0.000255
H  1.255261 -1.960423 0.000275
H  -0.083182 2.937096 0.000334
H  2.344863 2.255605 0.000427
H  -4.679456 -0.197744 -0.894058
H  -4.397407 -1.714056 0.000783
H  -4.679983 -0.196184 0.892809
H  4.886661 -1.410005 -0.000398
H  3.444572 -2.013046 -0.903448
H  3.445026 -2.013739 0.902896
