program: Gaussian 09
title: 000070702
version: EM64L-G09RevD.01
frameworkgroup: C1[X(C15H26O)]
method: RPBEPBE
basis: SDD
operation: Freq
keyword: #pfreq=noraman
keyword: PBEPBE/SDD
title: #p freq=noraman PBEPBE/SDD
converged: YES YES NO NO
title: Mulliken charges:
elementType: O C C C C C C C C C C C C C C C H H H H H H H H H H H H H H H H H H H H H H H H H H
charge: -0.442776 0.235900 -0.432672 -0.472347 -0.307981 0.417528 -0.521725 -0.769575 -0.083164 -0.471634 -0.831182 -0.294708 0.404863 -0.576846 -0.790277 -0.791791 0.229561 0.189191 0.217258 0.213999 0.212884 0.214727 0.190764 0.211403 0.239078 0.230522 0.209043 0.205880 0.202796 0.218192 0.227451 0.226218 0.323654 0.210885 0.211625 0.227177 0.225368 0.213382 0.216281 0.220000 0.217286 0.223764
chargesum: 0.00000
title: Mulliken charges with hydrogens summed into heavy atoms:
elementType: O C C C C C C C C C C C C C C C
charge: -0.119122 0.235900 -0.013920 -0.041090 -0.095097 0.417528 -0.116234 -0.088573 0.125879 -0.062958 -0.159321 -0.083823 0.404863 -0.138044 -0.135247 -0.130741
polarizability: 1.90170881e+02 4.48984593e+00 1.66493995e+02 -3.24906103e+00 5.61611133e-02 1.44254346e+02
1716.lowfreq: -7.0836 -5.0128 -0.0006 -0.0005 -0.0004 10.3329 18.9890 26.2690 36.0577
frequency: 17.8782 26.1276 35.6154 44.4497 57.6869 65.3617 78.4980 114.2330 128.5448 138.8878 142.6691 173.0811 190.8866 215.1252 227.2742 262.2416 279.0919 285.3805 292.7056 313.4774 317.8915 352.0270 381.4693 391.2078 411.0230 421.4489 432.6502 466.2564 502.7561 522.1072 533.5704 556.8688 690.6841 717.7034 742.6302 769.2461 794.5975 835.7773 847.4481 858.7282 885.9373 921.6029 936.6475 946.4493 946.4913 972.7222 984.3312 987.1184 993.9053 1010.2200 1015.7265 1025.0317 1039.5632 1044.7335 1080.1131 1082.4891 1102.9769 1113.9170 1125.2314 1139.6998 1154.0750 1201.2203 1203.7534 1228.1352 1237.0595 1256.9531 1268.0274 1295.0725 1295.8527 1322.1457 1326.2777 1358.6289 1363.2792 1370.4913 1386.7109 1391.9010 1394.7432 1397.0427 1419.9607 1452.9881 1455.6771 1457.3300 1461.6032 1466.4657 1468.2144 1470.7814 1471.1521 1473.4850 1480.6592 1483.8561 1484.4802 1656.0917 1690.6026 1697.4836 2950.8067 2954.4762 2960.2165 2962.4877 2962.6362 2971.8266 2977.7627 2999.5980 3024.9088 3025.8057 3027.3858 3028.6056 3029.3422 3042.1064 3049.3940 3052.2570 3066.9760 3069.7577 3077.9365 3088.6939 3095.7154 3099.0865 3099.8914 3104.3293 3199.5198 3532.7626
redmass: 3.5987 4.3593 3.0958 2.9848 2.8302 3.0095 3.2894 2.1583 1.3540 1.1856 1.4767 2.5998 1.3082 1.0827 2.3330 1.5260 1.5650 2.5126 2.8250 2.2147 2.4391 2.6460 2.2389 2.5210 2.4438 2.6442 2.5683 2.2866 2.4996 2.7771 2.4411 2.2660 2.1324 2.4645 2.3278 1.8574 1.8983 1.3439 1.7794 2.2438 1.8237 1.9144 1.7868 1.3656 1.3704 1.5451 1.7215 2.4580 1.2715 1.5148 1.3045 3.1153 1.6208 1.6930 1.6229 1.6455 1.8861 1.5976 1.9556 1.6006 1.5422 2.1473 1.1616 1.9955 1.8792 1.3501 1.2215 1.3525 1.3376 1.3868 1.5117 1.4018 1.4133 1.3777 1.3297 1.4487 1.3378 1.2644 1.1760 1.0635 1.0640 1.0765 1.0728 1.0753 1.0611 1.0649 1.0704 1.0639 1.0772 1.0788 1.0657 4.7920 6.8373 6.4799 1.0645 1.0374 1.0550 1.0393 1.0450 1.0647 1.0629 1.0357 1.0969 1.0994 1.0917 1.0966 1.0958 1.0953 1.0940 1.0861 1.0923 1.0919 1.0967 1.0955 1.0951 1.0999 1.0665 1.0998 1.1145 1.0659
irintensity: 0.2801 0.0579 0.2269 0.1435 0.2963 0.0964 0.4568 0.3084 0.6303 1.2617 0.4942 0.4456 1.7339 25.9827 8.8249 36.3132 79.7686 23.1547 8.9530 0.6511 1.3611 5.7664 1.9199 4.9723 3.3576 0.8400 11.1933 4.8066 2.5761 12.9635 4.4699 7.4881 6.9740 2.8278 3.4871 4.5648 0.4007 29.5371 26.3275 13.3313 8.6898 2.4907 10.0281 34.0003 37.4264 4.3179 18.9564 2.3195 3.7182 22.3282 3.6217 2.8103 3.4342 9.0497 1.0979 10.1261 16.2156 32.8477 22.3101 27.2775 3.9524 45.8977 0.3651 10.8707 4.1895 10.8309 5.9671 2.9074 1.8294 0.8678 1.6728 1.2234 18.5218 3.7288 19.8572 8.2009 33.7272 20.4966 24.7959 1.8553 3.1591 3.6616 4.0121 7.1312 5.2163 15.0454 25.7236 11.2038 9.6297 14.3409 6.4981 5.8061 1.9505 2.8075 26.5386 41.5641 28.9239 40.8170 37.5080 30.4854 88.8868 12.1560 6.6860 14.7988 19.8809 60.6718 28.5310 23.1180 9.5786 27.5610 7.2581 62.2198 60.0466 38.5482 33.8991 21.8883 9.5803 26.4651 22.3611 6.6362
temp: 298.150 k
press: 1.00000 atm
elementType: 8 6 6 6 6 6 6 6 6 6 6 6 6 6 6 6 1 1 1 1 1 1 1 1 1 1 1 1 1 1 1 1 1 1 1 1 1 1 1 1 1 1
symmnumber: 1
zpe: 968895.6 jmol-1
zpe.correction: 0.369033 hartree
zpe.thermalcorrener: 0.389921 hartree
zpe.thermalcorrenthalpy: 0.390865 hartree
zpe.thermalcorrgfe: 0.317619 hartree
zpe.sumelectzpe: -661.068279 hartree
zpe.sumelectthermal: -661.047391 hartree
zpe.sumelectthermalent: -661.046447 hartree
zpe.sumelectthermalfe: -661.119693 hartree
dipole: -0.7988 -0.7520 -0.9951
dipole: 1.4811
quadrupole: -105.2811 -101.5232 -97.4415
quadrupole: -3.7729 -4.7448 -5.9457
quadrupole: -3.8658 -0.1079 3.9737 -3.7729 -4.7448 -5.9457
hfenergy: -661.4373119 hartree
pointgroup: C01 [X(C15H26O1)]
dipole: 0.3177339 -0.2984664 0.3866864 debye
polarizability: 189.8083736|-4.9791187|166.6762092|-4.2913382|-0.0722532|144.43464 unknown
InChI: InChI=1S/C15H26O/c1-6-15(5,16)12-8-11-14(4)10-7-9-13(2)3/h6,9,11,16H,1,7-8,10,12H2,2-5H3
charge 0 multiplicity 1
42 atoms
O  -3.112645 2.076718 -0.38433
C  -2.957933 0.600657 -0.149262
C  -1.454687 0.322895 0.14138
C  -1.075735 -1.173516 0.322361
C  0.367474 -1.328037 0.757519
C  1.410002 -1.871504 0.064798
C  2.814678 -1.869081 0.659742
C  -3.428577 -0.023071 -1.468658
C  -3.809458 0.232322 1.06026
C  3.741504 -0.745849 0.073298
C  1.296613 -2.489364 -1.318793
C  3.381747 0.634755 0.582291
C  2.779643 1.655788 -0.093233
C  -4.87935 -0.598557 1.094895
C  2.474484 2.975595 0.599078
C  2.355437 1.59723 -1.550024
H  -0.861328 0.757535 -0.68624
H  -1.165007 0.873813 1.063053
H  -1.743704 -1.616225 1.089843
H  -1.269206 -1.720672 -0.617609
H  0.591426 -0.910273 1.752866
H  2.761295 -1.737846 1.757724
H  3.301456 -2.849201 0.473299
H  -3.410212 -1.12519 -1.424207
H  -4.455037 0.308324 -1.698308
H  -2.769702 0.310007 -2.288694
H  -3.492731 0.724095 1.996731
H  4.783791 -0.979562 0.372633
H  3.718769 -0.788214 -1.031165
H  2.019282 -2.02848 -2.020836
H  1.539864 -3.570117 -1.282886
H  0.291516 -2.385154 -1.759161
H  -2.827498 2.553368 0.438965
H  3.623489 0.806311 1.644178
H  -5.431961 -0.777181 2.024432
H  -5.237554 -1.123992 0.202743
H  2.799925 2.970865 1.654134
H  1.387493 3.193675 0.57378
H  2.976867 3.821263 0.087958
H  1.263375 1.765587 -1.640037
H  2.848124 2.399097 -2.13556
H  2.586073 0.632287 -2.029257
