program: Orca
programVersion: 5.0.4
elementType: C H H H
charge: 0
multiplicity: 2
keywords: SP DLPNO-CCSD(T) aug-cc-pV5Z aug-cc-pV5Z/C TightSCF
keywords: NoFrozenCore
formula: CH3
InChI: InChI=1/CH3/h1H3
4 atoms
C  -0.000097 0.000095 0.000062
H  1.015407 0.346221 0.091798
H  -0.507145 -0.413687 0.855101
H  -0.507102 0.066337 -0.94764
totalener: -39.58107596 hartree
nucrepener: 9.69707844 hartree
electener: -49.27815440 hartree
oneelecener: -71.62307167 hartree
twoeener: 22.34491727 hartree
kineticenergy: 39.55121379 hartree
s2: 0.761744
chargesum: 0.0000000
charge: -0.710372 0.236603 0.236985 0.236785
charge: 1.411377 -0.470508 -0.470464 -0.470406
qa: -0.7104 0.2366 0.2370 0.2368
va: 3.7454 0.9636 0.9633 0.9634
corrType: DLPNO BASED
energy: -39.811912747200 hartree
dipole: 0.00109 -0.00085 0.00023 -0.00106 0.00057 -0.00049 -0.00070 0.00055 -0.00015
magnitude: 0.00056 au
magnitude: 0.00142 debye
