program: Gaussian 09
title: 000070645
version: EM64L-G09RevD.01
frameworkgroup: C1[X(C9H13NO2)]
method: RPBEPBE
basis: SDD
operation: Freq
keyword: #p
keyword: freq=noraman
keyword: PBEPBE/SDD
title: #p freq=noraman PBEPBE/SDD
converged: YES YES NO NO
title: Mulliken charges:
elementType: O O N C C C C C C C C C H H H H H H H H H H H H H
charge: -0.454843 -0.464769 -0.244872 0.212729 0.326052 -0.503608 -0.570598 -0.363804 -0.365678 -0.315752 -0.299033 -0.153090 0.250345 0.198132 0.217913 0.246935 0.245332 0.245902 0.219964 0.186485 0.181550 0.215223 0.241659 0.359240 0.388588
chargesum: 0.00000
title: Mulliken charges with hydrogens summed into heavy atoms:
elementType: O O N C C C C C C C C C
charge: -0.095603 -0.076181 -0.244872 0.212729 0.326052 -0.055132 -0.105751 -0.118472 -0.119776 0.090697 0.097740 0.088569
polarizability: 1.33130713e+02 -3.52706408e+00 1.29437507e+02 -5.94101616e+00 -4.97806034e+00 6.78793979e+01
1716.lowfreq: -5.9167 -0.0009 -0.0008 -0.0005 2.2844 7.9358 44.5056 68.3480 88.4906
frequency: 44.4577 68.3260 88.4869 151.1090 152.8086 169.0936 254.6285 269.5887 326.6950 355.1202 422.7824 442.7387 471.4684 521.9369 570.3645 620.7476 657.1230 695.7817 750.4520 801.4431 831.2834 842.4018 860.0695 905.3149 911.4779 931.7511 985.6388 994.3700 995.4274 1008.7754 1012.0064 1028.8254 1057.1249 1083.9323 1158.0407 1171.0301 1172.6779 1189.5559 1201.3216 1240.0582 1256.9298 1300.0879 1311.4661 1326.0884 1343.7563 1355.7793 1376.5856 1406.2439 1442.7027 1445.0625 1451.6984 1466.5831 1485.8124 1551.8653 1581.0657 1590.3650 2783.8072 2948.2078 2954.2298 2988.0607 3002.3777 3048.9764 3060.2777 3060.9285 3066.7310 3137.7131 3156.0932 3168.9518 3407.6412
redmass: 4.1009 5.7279 4.4236 3.6350 2.6562 3.8086 2.6282 2.7766 4.6514 4.8673 2.5660 2.1211 3.2298 4.1488 3.2507 1.2317 2.6643 5.2402 1.8185 1.7419 2.4414 2.7499 2.4958 1.3425 1.2521 2.0513 4.9684 1.3658 4.1641 2.2702 3.6345 2.6683 1.9946 1.6848 1.1924 1.1715 1.1143 1.2337 1.1796 1.5305 2.0053 1.8825 1.5101 1.9153 1.3295 1.4975 1.1984 2.7332 1.2228 1.2209 1.7641 1.0911 1.0805 1.6910 2.9405 3.9887 1.0702 1.0695 1.0673 1.0622 1.0600 1.0960 1.0984 1.0986 1.1001 1.0874 1.0929 1.1001 1.0690
irintensity: 1.7107 2.8479 3.2080 0.6158 2.7984 7.7938 1.3071 2.7267 5.0780 4.8698 4.7179 10.0739 9.2946 0.8446 3.0114 207.2550 36.5876 4.0809 23.5809 30.8515 7.0813 9.0322 3.1140 4.7075 76.2581 13.2697 4.9996 2.5329 29.1930 12.5108 116.1762 15.1999 11.2437 25.8811 6.8393 2.7404 2.3523 7.3417 51.1562 18.6345 2.1041 0.7116 12.4285 2.6222 12.9097 10.9519 8.7507 0.8212 2.4322 22.1683 80.7535 3.7017 2.3267 87.0814 126.8036 18.8571 669.1111 51.9830 79.0545 16.4198 18.6062 52.4865 32.0181 36.5549 32.0975 4.7963 14.5495 11.9367 198.1857
temp: 298.150 k
press: 1.00000 atm
elementType: 8 8 7 6 6 6 6 6 6 6 6 6 1 1 1 1 1 1 1 1 1 1 1 1 1
symmnumber: 1
zpe: 543656.8 jmol-1
zpe.correction: 0.207068 hartree
zpe.thermalcorrener: 0.218481 hartree
zpe.thermalcorrenthalpy: 0.219425 hartree
zpe.thermalcorrgfe: 0.169174 hartree
zpe.sumelectzpe: -555.022788 hartree
zpe.sumelectthermal: -555.011374 hartree
zpe.sumelectthermalent: -555.010430 hartree
zpe.sumelectthermalfe: -555.060682 hartree
dipole: -3.9269 -5.1149 1.2795
dipole: 6.5742
quadrupole: -69.1405 -73.5911 -73.0090
quadrupole: -10.1244 -0.8212 0.5148
quadrupole: 2.7730 -1.6776 -1.0954 -10.1244 -0.8212 0.5148
hfenergy: -555.2298557 hartree
pointgroup: C01 [X(C9H13N1O2)]
dipole: 0.3762473 -2.4957393 -0.5653226 debye
dipolederiv: -0.5309298 -0.234844 -0.1046327 -0.0794417 -0.806934 0.1171504 -0.117495 0.0796626 -0.5476105 -0.981145 -0.0992987 0.0342375 -0.0673626 -0.8056439 -0.0142623 0.0593891 0.0315479 -0.5454776 -0.6739981 -0.0124264 -0.0049659 -0.1265008 -0.5026443 -0.0438631 -0.0026906 0.0142434 -0.2261843 0.536038 -0.2730048 0.013825 -0.4595241 0.388642 0.1050838 -0.112915 0.0950054 0.0397038 0.4309251 0.1729914 0.0200873 0.3843107 0.3351672 0.0984896 0.1212071 0.1008779 0.0531601 0.0140225 0.1166067 -0.0142271 0.2870061 -0.3019515 0.0704569 -0.0602642 0.2296845 -0.0766412 -0.0294346 -0.0418739 -0.0212262 -0.1290818 -0.1972835 0.0407945 -0.0462176 0.0750378 0.0348244 -0.1923957 0.1086086 0.0203226 0.365114 -0.2889534 -0.0116325 0.1094604 -0.070248 -0.1407426 -0.1947996 -0.0926605 -0.0413137 -0.3481948 -0.2364762 -0.0102726 -0.120511 -0.0536438 -0.1432992 0.3121755 0.2517179 0.0660474 0.0297491 0.7499075 -0.0216862 0.1702319 -0.1641099 0.4165558 0.5188519 -0.0586355 -0.1137941 -0.0534427 0.3776519 0.0496605 -0.2257869 -0.0322432 0.4476279 0.2885983 -0.0230889 0.0003318 -0.0012405 0.1905048 0.0978271 -0.008197 0.0642087 -0.0590048 0.0565945 0.0258278 -0.0176369 0.0340474 0.0738954 -0.0670325 0.0318309 -0.0515392 -0.0532114 -0.0893455 -0.0627807 -0.0027381 -0.1510513 -0.054268 0.0087701 -0.0468133 -0.0103541 0.0950913 -0.0667086 0.0512111 0.0521412 0.1323797 -0.0210813 -0.0473077 0.1025845 -0.0331485 0.069207 0.0444 -0.0445975 -0.0149543 -0.0538628 0.0758582 -0.0260716 -0.0559609 0.0065258 -0.0976918 -0.0635326 -0.0781855 -0.0167409 -0.0646325 0.0660784 -0.0249853 -0.0212361 -0.0170097 0.1501584 -0.0537214 0.0785285 0.0312836 0.0558066 0.0680752 -0.0272966 0.0362917 -0.0274869 0.1499832 -0.1867029 0.0480486 -0.0496807 0.0872589 -0.0132967 0.0130187 -0.0412462 0.0382008 0.0771222 0.0506657 -0.0126702 0.0859433 -0.0427155 -0.0398593 -0.1085809 0.0239966 -0.059759 -0.1774523 0.0236826 0.0260921 -0.0378531 0.0594832 0.0299947 -0.0636443 0.0583636 -0.0074971 -0.2402664 -0.1585718 -0.1125303 0.0144546 -0.1467596 -0.0492496 -0.0024127 -0.0205177 -0.0187707 0.072247 0.0923791 -0.0055805 0.0001548 -0.0040959 -0.090474 -0.0653895 0.0023597 -0.065308 0.1227435 0.4337704 0.003183 0.0747476 -0.0014864 0.3335575 -0.0701398 0.1106005 -0.1246367 0.3203005 0.4191818 0.2693617 0.0261869 0.2942372 0.7187829 0.0033264 0.0535354 0.0007601 0.2588568 unknown
polarizability: 135.3680407|-0.0359704|126.8136781|-0.0994475|9.0562327|68.2658986 unknown
InChI: InChI=1S/C9H13NO2/c11-6-4-8-2-1-3-9(10-8)5-7-12/h1-3,11-12H,4-7H2
charge 0 multiplicity 1
25 atoms
O  -1.764162 2.613465 -0.10753
O  1.162105 2.290551 0.39028
N  0.067281 -0.035699 0.514608
C  -1.13892 -0.643939 0.309803
C  1.246913 -0.682567 0.240295
C  -2.369066 0.21853 0.486355
C  2.489193 0.178844 0.402988
C  -1.193129 -1.996097 -0.116762
C  1.250823 -2.02758 -0.195997
C  -2.450584 1.403794 -0.537095
C  2.285904 1.584822 -0.238857
C  0.012701 -2.69215 -0.355761
H  -2.387343 0.671531 1.495072
H  -3.273612 -0.4089 0.380467
H  3.368641 -0.322068 -0.040584
H  2.696541 0.326486 1.481718
H  -2.161946 -2.483774 -0.261703
H  2.196671 -2.534931 -0.408963
H  -3.509151 1.704179 -0.621903
H  -2.107556 1.0618 -1.537625
H  2.116367 1.475005 -1.332335
H  3.19196 2.198311 -0.088387
H  -0.01153 -3.737534 -0.682043
H  -0.77371 2.566856 -0.225823
H  0.533008 1.524365 0.684183
