program: Orca
programVersion: 5.0.4
elementType: C H H H
charge: 0
multiplicity: 2
keywords: SP M062X 6-311+G(d,p) def2-TZVP/C def2/J TightSCF
formula: CH3
InChI: InChI=1/CH3/h1H3
4 atoms
C  -0.000097 0.000095 0.000062
H  1.015407 0.346221 0.091797
H  -0.507145 -0.413687 0.855101
H  -0.507102 0.066337 -0.94764
totalener: -39.82097485 hartree
nucrepener: 9.69707835 hartree
electener: -49.51805320 hartree
oneelecener: -71.66133081 hartree
twoeener: 22.14327761 hartree
kineticenergy: 39.65098843 hartree
xcener: -3.110481290342 hartree
s2: 0.754647
energy: -286.9310 -21.1991 -13.3814 -13.3767 -7.8075 1.0793 1.6428 1.6437 2.4744 5.1790 5.2997 5.3033 11.9716 11.9739 13.2438 15.6736 17.9149 17.9208 20.5777 29.8383 29.8429 39.3317 39.9729 39.9852 42.4564 46.1380 53.2252 53.2382 53.8261 53.8421 66.0944 67.4336 67.4365 72.8849 72.8893 74.6157 75.9224 102.5465 102.5521 653.2304 electronvolt
energy: -286.7450 -19.8885 -13.0296 -13.0239 -1.1649 0.7386 1.6975 1.6980 3.4306 5.4046 5.4084 5.6170 11.7970 11.7993 13.4660 16.2547 18.5125 18.5185 21.1130 30.8885 30.8948 39.6103 40.3628 40.3678 44.3197 46.4174 53.5264 53.5406 54.6663 54.6836 66.8504 67.7810 67.7892 73.5476 73.5598 74.7669 77.6942 103.4979 103.5283 653.5645 electronvolt
chargesum: 0.0000000
charge: -0.482158 0.160702 0.160753 0.160704
charge: -0.095760 0.031903 0.031918 0.031940
qa: -0.4822 0.1607 0.1608 0.1607
va: 3.8643 0.9589 0.9590 0.9590
energy: -39.820974852344 hartree
dipole: 0.00109 -0.00080 0.00029 -0.00106 0.00049 -0.00057 -0.00070 0.00044 -0.00026
magnitude: 0.00069 au
magnitude: 0.00176 debye
